{"text_format":"1","workbook":"xlsx","n_sheets":4,"sheets":["Orientações","CALCULADORA","atualização","Índices"],"not_rendered":{"charts":0,"images":1,"macros":1,"external_links":0,"defined_names":5,"comments":0,"pivot_tables":0},"unopened":[],"bounds":{"document_bytes":16777216,"sheet_cells":100000,"rows_first":2000,"rows_last":500,"rows_between":2000,"halvings":0,"cell_chars":16384,"cell_head_chars":4096},"cells_cut":0,"cells_raw":0,"read":"whole","date_system":"1900"}

{"sheet":"Orientações","index":0,"n_rows":12,"n_cols":2,"rows_kept":12,"cut":false,"hidden":false,"merged":[]}
[]
[null,"ORIENTAÇÕES DE USO – CALCULADORA DE CRÉDITO NÃO TRIBUTÁRIO"]
[]
[null,"Como usar a calculadora"]
[null,"1. Ao Abrir o arquivo habilite a execução da macro.\n2. Acesse a aba CALCULADORA.\n3. Informe a DATA INICIAL (célula C7): deve ser o mês subsequente ao mês do vencimento do crédito.\n   Exemplo: vencimento em 15/01/2024 → Data Inicial = 02/2024.\n4. Informe a DATA FINAL (célula C8): mês de apuração (data do cálculo).\n5. Informe o VALOR PRINCIPAL (célula C9): valor original do crédito em R$.\n6. Os resultados aparecem automaticamente na seção RESULTADO DO CÁLCULO.\n7. A memória detalhada mês a mês é exibida na tabela abaixo."]
[]
[null,"Entendendo os períodos de cálculo"]
[null,"• 02/2000 a 02/2018 → Taxa SELIC acumulada (correção monetária já inclusa nos juros).\n  O valor nominal do principal e da multa permanece inalterado.\n\n• 03/2018 a 09/2023 → Correção: IPCA do mês anterior (Decreto 45.708/2018).\n  Juros: 1% a.m. fixo sobre o total do débito (Lei 16.226/2017).\n\n• 10/2023 em diante → Correção: IPCA limitado à SELIC.\n  Juros: diferença positiva entre SELIC e IPCA (quando IPCA ≥ SELIC, juros = 0).\n  Base: decisão do STF que vedou índices estaduais superiores aos da União."]
[]
[]
[null,"Base legal e referências"]
[null,"• Lei Estadual nº 10.654/1991, arts. 86 e 90 (atualização monetária e juros de tributos estaduais)\n• Lei Estadual nº 16.226/2017 (retorno aos 1% de juros a partir de 03/2018)\n• Decreto Estadual nº 45.708/2018 (uso do IPCA como índice de correção)\n• Lei Estadual nº 13.178/2006, art. 3º (prazo de 10 dias no TCC para crédito não tributário)\n• Decisão do STF (ADPF/RE) – vedação a índices estaduais superiores aos federais (vigência 10/2023)\n• STJ – EDcl no AgInt no AREsp 948395/RS, DJ 19/08/2019 (irretroatividade de normas de juros)\n• Nota Técnica nº 2/2026 – Diretoria de Sistemas Corporativos Tributários – SEFAZ/PE"]

{"sheet":"CALCULADORA","index":1,"n_rows":501,"n_cols":8,"rows_kept":501,"cut":false,"hidden":false,"merged":[[422,1,422,5],[18,1,18,5],[14,2,14,5],[421,1,421,5],[11,1,11,5],[12,2,12,5],[16,2,16,5],[15,2,15,5],[13,2,13,5],[4,1,4,5],[6,1,6,5],[9,4,9,5],[1,1,1,5],[2,1,2,5],[7,4,7,5],[3,1,3,5],[8,4,8,5]]}
[]
[]
[]
[null,"CALCULADORA DE ATUALIZAÇÃO DE CRÉDITO NÃO TRIBUTÁRIO"]
[null,"Atualização Monetária e Juros Moratórios – Boletim GCI Nº 03/2026"]
[]
[null,"DADOS DE ENTRADA"]
[null,"DATA INICIAL\n(Mês seguinte ao vencimento)","2018-11-01","Devedor"]
[null,"DATA FINAL\n(Data de apuração)","2026-03-01","Origem do Débito","Ex. não aplicação dos recursos da emenda parlamentar nº xxxxxxxx"]
[null,"Valor Principal (R$)",200000,"Responsável pela atualização"]
[]
[null,"RESULTADO DO CÁLCULO"]
[null,"Índice de Correção Aplicado","Período 02/2000–02/2018: SELIC (correção+juros inclusos)\nPeríodo 03/2018–09/2023: IPCA (correção) + 1% a.m. (juros)\nPeríodo 10/2023–atual: IPCA limitado SELIC (correção) + máx(SELIC–IPCA) (juros)"]
[null,"Valor Principal",{"$f":"C10","v":200000}]
[null,"Valor da Atualização Monetária",{"$f":"IFERROR(INDEX(E21:E420,MATCH(2,1/(E21:E420<>\"\"),1))-C10,0)","v":92770.006368750823}]
[null,"Valor dos Juros",{"$f":"IFERROR(LOOKUP(2,1/(F21:F420<>\"\"),F21:F420),0)","v":229297.46898800222}]
[null,"Valor Final a Pagar",{"$f":"C10+C15+C16","v":522067.47535675304}]
[]
[null,"MEMÓRIA DE CÁLCULO DETALHADA"]
[null,"Mês","Atualiz. %","Juros %","Crédito Corrigido (R$)","Juros Acumulados (R$)"]
[null,{"$f":"IFERROR(IF(EDATE($C$8,0)>$C$9,\"\",IF(EDATE($C$8,0)>DATE(2099,12,1),\"\",EDATE($C$8,0))),\"\")","v":"2018-11-01"},{"$f":"IFERROR(IF(B21=\"\",\"\",VLOOKUP(B21,Índices!$A:$H,5,0)),\"\")","v":4.7999999999999996E-3},{"$f":"IFERROR(IF(B21=\"\",\"\",VLOOKUP(B21,Índices!$A:$H,6,0)),\"\")","v":0.01},{"$f":"IFERROR(IF(B21=\"\",\"\",$C$10*VLOOKUP(B21,Índices!$A:$H,7,0)/VLOOKUP(EDATE($C$8,-1),Índices!$A:$H,7,0)),\"\")","v":200959.99999999997},{"$f":"IFERROR(IF(B21=\"\",\"\",E21*(VLOOKUP(B21,Índices!$A:$H,8,0)-VLOOKUP(EDATE($C$8,-1),Índices!$A:$H,8,0))),\"\")","v":2009.5999999999569},null,{"$f":"IF(B21=\"\",\"vazia\",\"1\")","v":"1"}]
[null,{"$f":"IFERROR(IF(EDATE($C$8,1)>$C$9,\"\",IF(EDATE($C$8,1)>DATE(2099,12,1),\"\",EDATE($C$8,1))),\"\")","v":"2018-12-01"},{"$f":"IFERROR(IF(B22=\"\",\"\",VLOOKUP(B22,Índices!$A:$H,5,0)),\"\")","v":4.4999999999999997E-3},{"$f":"IFERROR(IF(B22=\"\",\"\",VLOOKUP(B22,Índices!$A:$H,6,0)),\"\")","v":0.01},{"$f":"IFERROR(IF(B22=\"\",\"\",$C$10*VLOOKUP(B22,Índices!$A:$H,7,0)/VLOOKUP(EDATE($C$8,-1),Índices!$A:$H,7,0)),\"\")","v":201864.31999999998},{"$f":"IFERROR(IF(B22=\"\",\"\",E22*(VLOOKUP(B22,Índices!$A:$H,8,0)-VLOOKUP(EDATE($C$8,-1),Índices!$A:$H,8,0))),\"\")","v":4037.2863999999136},null,{"$f":"IF(B22=\"\",\"vazia\",\"1\")","v":"1"}]
[null,{"$f":"IFERROR(IF(EDATE($C$8,2)>$C$9,\"\",IF(EDATE($C$8,2)>DATE(2099,12,1),\"\",EDATE($C$8,2))),\"\")","v":"2019-01-01"},{"$f":"IFERROR(IF(B23=\"\",\"\",VLOOKUP(B23,Índices!$A:$H,5,0)),\"\")","v":-2.0999999999999999E-3},{"$f":"IFERROR(IF(B23=\"\",\"\",VLOOKUP(B23,Índices!$A:$H,6,0)),\"\")","v":0.01},{"$f":"IFERROR(IF(B23=\"\",\"\",$C$10*VLOOKUP(B23,Índices!$A:$H,7,0)/VLOOKUP(EDATE($C$8,-1),Índices!$A:$H,7,0)),\"\")","v":201440.40492799997},{"$f":"IFERROR(IF(B23=\"\",\"\",E23*(VLOOKUP(B23,Índices!$A:$H,8,0)-VLOOKUP(EDATE($C$8,-1),Índices!$A:$H,8,0))),\"\")","v":6043.2121478398703},null,"1"]
[null,{"$f":"IFERROR(IF(EDATE($C$8,3)>$C$9,\"\",IF(EDATE($C$8,3)>DATE(2099,12,1),\"\",EDATE($C$8,3))),\"\")","v":"2019-02-01"},{"$f":"IFERROR(IF(B24=\"\",\"\",VLOOKUP(B24,Índices!$A:$H,5,0)),\"\")","v":1.5E-3},{"$f":"IFERROR(IF(B24=\"\",\"\",VLOOKUP(B24,Índices!$A:$H,6,0)),\"\")","v":0.01},{"$f":"IFERROR(IF(B24=\"\",\"\",$C$10*VLOOKUP(B24,Índices!$A:$H,7,0)/VLOOKUP(EDATE($C$8,-1),Índices!$A:$H,7,0)),\"\")","v":201742.56553539197},{"$f":"IFERROR(IF(B24=\"\",\"\",E24*(VLOOKUP(B24,Índices!$A:$H,8,0)-VLOOKUP(EDATE($C$8,-1),Índices!$A:$H,8,0))),\"\")","v":8069.7026214155067},null,"1"]
[null,{"$f":"IFERROR(IF(EDATE($C$8,4)>$C$9,\"\",IF(EDATE($C$8,4)>DATE(2099,12,1),\"\",EDATE($C$8,4))),\"\")","v":"2019-03-01"},{"$f":"IFERROR(IF(B25=\"\",\"\",VLOOKUP(B25,Índices!$A:$H,5,0)),\"\")","v":3.2000000000000002E-3},{"$f":"IFERROR(IF(B25=\"\",\"\",VLOOKUP(B25,Índices!$A:$H,6,0)),\"\")","v":0.01},{"$f":"IFERROR(IF(B25=\"\",\"\",$C$10*VLOOKUP(B25,Índices!$A:$H,7,0)/VLOOKUP(EDATE($C$8,-1),Índices!$A:$H,7,0)),\"\")","v":202388.14174510521},{"$f":"IFERROR(IF(B25=\"\",\"\",E25*(VLOOKUP(B25,Índices!$A:$H,8,0)-VLOOKUP(EDATE($C$8,-1),Índices!$A:$H,8,0))),\"\")","v":10119.407087255046},null,"1"]
[null,{"$f":"IFERROR(IF(EDATE($C$8,5)>$C$9,\"\",IF(EDATE($C$8,5)>DATE(2099,12,1),\"\",EDATE($C$8,5))),\"\")","v":"2019-04-01"},{"$f":"IFERROR(IF(B26=\"\",\"\",VLOOKUP(B26,Índices!$A:$H,5,0)),\"\")","v":4.3E-3},{"$f":"IFERROR(IF(B26=\"\",\"\",VLOOKUP(B26,Índices!$A:$H,6,0)),\"\")","v":0.01},{"$f":"IFERROR(IF(B26=\"\",\"\",$C$10*VLOOKUP(B26,Índices!$A:$H,7,0)/VLOOKUP(EDATE($C$8,-1),Índices!$A:$H,7,0)),\"\")","v":203258.41075460915},{"$f":"IFERROR(IF(B26=\"\",\"\",E26*(VLOOKUP(B26,Índices!$A:$H,8,0)-VLOOKUP(EDATE($C$8,-1),Índices!$A:$H,8,0))),\"\")","v":12195.504645276289},null,"1"]
[null,{"$f":"IFERROR(IF(EDATE($C$8,6)>$C$9,\"\",IF(EDATE($C$8,6)>DATE(2099,12,1),\"\",EDATE($C$8,6))),\"\")","v":"2019-05-01"},{"$f":"IFERROR(IF(B27=\"\",\"\",VLOOKUP(B27,Índices!$A:$H,5,0)),\"\")","v":7.4999999999999997E-3},{"$f":"IFERROR(IF(B27=\"\",\"\",VLOOKUP(B27,Índices!$A:$H,6,0)),\"\")","v":0.01},{"$f":"IFERROR(IF(B27=\"\",\"\",$C$10*VLOOKUP(B27,Índices!$A:$H,7,0)/VLOOKUP(EDATE($C$8,-1),Índices!$A:$H,7,0)),\"\")","v":204782.84883526876},{"$f":"IFERROR(IF(B27=\"\",\"\",E27*(VLOOKUP(B27,Índices!$A:$H,8,0)-VLOOKUP(EDATE($C$8,-1),Índices!$A:$H,8,0))),\"\")","v":14334.799418468507},null,"1"]
[null,{"$f":"IFERROR(IF(EDATE($C$8,7)>$C$9,\"\",IF(EDATE($C$8,7)>DATE(2099,12,1),\"\",EDATE($C$8,7))),\"\")","v":"2019-06-01"},{"$f":"IFERROR(IF(B28=\"\",\"\",VLOOKUP(B28,Índices!$A:$H,5,0)),\"\")","v":5.7000000000000002E-3},{"$f":"IFERROR(IF(B28=\"\",\"\",VLOOKUP(B28,Índices!$A:$H,6,0)),\"\")","v":0.01},{"$f":"IFERROR(IF(B28=\"\",\"\",$C$10*VLOOKUP(B28,Índices!$A:$H,7,0)/VLOOKUP(EDATE($C$8,-1),Índices!$A:$H,7,0)),\"\")","v":205950.11107362976},{"$f":"IFERROR(IF(B28=\"\",\"\",E28*(VLOOKUP(B28,Índices!$A:$H,8,0)-VLOOKUP(EDATE($C$8,-1),Índices!$A:$H,8,0))),\"\")","v":16476.008885890031},null,"1"]
[null,{"$f":"IFERROR(IF(EDATE($C$8,8)>$C$9,\"\",IF(EDATE($C$8,8)>DATE(2099,12,1),\"\",EDATE($C$8,8))),\"\")","v":"2019-07-01"},{"$f":"IFERROR(IF(B29=\"\",\"\",VLOOKUP(B29,Índices!$A:$H,5,0)),\"\")","v":1.2999999999999999E-3},{"$f":"IFERROR(IF(B29=\"\",\"\",VLOOKUP(B29,Índices!$A:$H,6,0)),\"\")","v":0.01},{"$f":"IFERROR(IF(B29=\"\",\"\",$C$10*VLOOKUP(B29,Índices!$A:$H,7,0)/VLOOKUP(EDATE($C$8,-1),Índices!$A:$H,7,0)),\"\")","v":206217.84621802552},{"$f":"IFERROR(IF(B29=\"\",\"\",E29*(VLOOKUP(B29,Índices!$A:$H,8,0)-VLOOKUP(EDATE($C$8,-1),Índices!$A:$H,8,0))),\"\")","v":18559.606159621901},null,"1"]
[null,{"$f":"IFERROR(IF(EDATE($C$8,9)>$C$9,\"\",IF(EDATE($C$8,9)>DATE(2099,12,1),\"\",EDATE($C$8,9))),\"\")","v":"2019-08-01"},{"$f":"IFERROR(IF(B30=\"\",\"\",VLOOKUP(B30,Índices!$A:$H,5,0)),\"\")","v":1E-4},{"$f":"IFERROR(IF(B30=\"\",\"\",VLOOKUP(B30,Índices!$A:$H,6,0)),\"\")","v":0.01},{"$f":"IFERROR(IF(B30=\"\",\"\",$C$10*VLOOKUP(B30,Índices!$A:$H,7,0)/VLOOKUP(EDATE($C$8,-1),Índices!$A:$H,7,0)),\"\")","v":206238.46800264734},{"$f":"IFERROR(IF(B30=\"\",\"\",E30*(VLOOKUP(B30,Índices!$A:$H,8,0)-VLOOKUP(EDATE($C$8,-1),Índices!$A:$H,8,0))),\"\")","v":20623.846800264295},null,"1"]
[null,{"$f":"IFERROR(IF(EDATE($C$8,10)>$C$9,\"\",IF(EDATE($C$8,10)>DATE(2099,12,1),\"\",EDATE($C$8,10))),\"\")","v":"2019-09-01"},{"$f":"IFERROR(IF(B31=\"\",\"\",VLOOKUP(B31,Índices!$A:$H,5,0)),\"\")","v":1.9E-3},{"$f":"IFERROR(IF(B31=\"\",\"\",VLOOKUP(B31,Índices!$A:$H,6,0)),\"\")","v":0.01},{"$f":"IFERROR(IF(B31=\"\",\"\",$C$10*VLOOKUP(B31,Índices!$A:$H,7,0)/VLOOKUP(EDATE($C$8,-1),Índices!$A:$H,7,0)),\"\")","v":206630.32109185238},{"$f":"IFERROR(IF(B31=\"\",\"\",E31*(VLOOKUP(B31,Índices!$A:$H,8,0)-VLOOKUP(EDATE($C$8,-1),Índices!$A:$H,8,0))),\"\")","v":22729.335320103277},null,"1"]
[null,{"$f":"IFERROR(IF(EDATE($C$8,11)>$C$9,\"\",IF(EDATE($C$8,11)>DATE(2099,12,1),\"\",EDATE($C$8,11))),\"\")","v":"2019-10-01"},{"$f":"IFERROR(IF(B32=\"\",\"\",VLOOKUP(B32,Índices!$A:$H,5,0)),\"\")","v":1.1000000000000001E-3},{"$f":"IFERROR(IF(B32=\"\",\"\",VLOOKUP(B32,Índices!$A:$H,6,0)),\"\")","v":0.01},{"$f":"IFERROR(IF(B32=\"\",\"\",$C$10*VLOOKUP(B32,Índices!$A:$H,7,0)/VLOOKUP(EDATE($C$8,-1),Índices!$A:$H,7,0)),\"\")","v":206857.61444505345},{"$f":"IFERROR(IF(B32=\"\",\"\",E32*(VLOOKUP(B32,Índices!$A:$H,8,0)-VLOOKUP(EDATE($C$8,-1),Índices!$A:$H,8,0))),\"\")","v":24822.913733405883},null,"1"]
[null,{"$f":"IFERROR(IF(EDATE($C$8,12)>$C$9,\"\",IF(EDATE($C$8,12)>DATE(2099,12,1),\"\",EDATE($C$8,12))),\"\")","v":"2019-11-01"},{"$f":"IFERROR(IF(B33=\"\",\"\",VLOOKUP(B33,Índices!$A:$H,5,0)),\"\")","v":-4.0000000000000002E-4},{"$f":"IFERROR(IF(B33=\"\",\"\",VLOOKUP(B33,Índices!$A:$H,6,0)),\"\")","v":0.01},{"$f":"IFERROR(IF(B33=\"\",\"\",$C$10*VLOOKUP(B33,Índices!$A:$H,7,0)/VLOOKUP(EDATE($C$8,-1),Índices!$A:$H,7,0)),\"\")","v":206774.87139927543},{"$f":"IFERROR(IF(B33=\"\",\"\",E33*(VLOOKUP(B33,Índices!$A:$H,8,0)-VLOOKUP(EDATE($C$8,-1),Índices!$A:$H,8,0))),\"\")","v":26880.733281905232},null,"1"]
[null,{"$f":"IFERROR(IF(EDATE($C$8,13)>$C$9,\"\",IF(EDATE($C$8,13)>DATE(2099,12,1),\"\",EDATE($C$8,13))),\"\")","v":"2019-12-01"},{"$f":"IFERROR(IF(B34=\"\",\"\",VLOOKUP(B34,Índices!$A:$H,5,0)),\"\")","v":1E-3},{"$f":"IFERROR(IF(B34=\"\",\"\",VLOOKUP(B34,Índices!$A:$H,6,0)),\"\")","v":0.01},{"$f":"IFERROR(IF(B34=\"\",\"\",$C$10*VLOOKUP(B34,Índices!$A:$H,7,0)/VLOOKUP(EDATE($C$8,-1),Índices!$A:$H,7,0)),\"\")","v":206981.64627067468},{"$f":"IFERROR(IF(B34=\"\",\"\",E34*(VLOOKUP(B34,Índices!$A:$H,8,0)-VLOOKUP(EDATE($C$8,-1),Índices!$A:$H,8,0))),\"\")","v":28977.430477893839},null,"1"]
[null,{"$f":"IFERROR(IF(EDATE($C$8,14)>$C$9,\"\",IF(EDATE($C$8,14)>DATE(2099,12,1),\"\",EDATE($C$8,14))),\"\")","v":"2020-01-01"},{"$f":"IFERROR(IF(B35=\"\",\"\",VLOOKUP(B35,Índices!$A:$H,5,0)),\"\")","v":5.1000000000000004E-3},{"$f":"IFERROR(IF(B35=\"\",\"\",VLOOKUP(B35,Índices!$A:$H,6,0)),\"\")","v":0.01},{"$f":"IFERROR(IF(B35=\"\",\"\",$C$10*VLOOKUP(B35,Índices!$A:$H,7,0)/VLOOKUP(EDATE($C$8,-1),Índices!$A:$H,7,0)),\"\")","v":208037.25266665517},{"$f":"IFERROR(IF(B35=\"\",\"\",E35*(VLOOKUP(B35,Índices!$A:$H,8,0)-VLOOKUP(EDATE($C$8,-1),Índices!$A:$H,8,0))),\"\")","v":31205.587899997612},null,"1"]
[null,{"$f":"IFERROR(IF(EDATE($C$8,15)>$C$9,\"\",IF(EDATE($C$8,15)>DATE(2099,12,1),\"\",EDATE($C$8,15))),\"\")","v":"2020-02-01"},{"$f":"IFERROR(IF(B36=\"\",\"\",VLOOKUP(B36,Índices!$A:$H,5,0)),\"\")","v":1.15E-2},{"$f":"IFERROR(IF(B36=\"\",\"\",VLOOKUP(B36,Índices!$A:$H,6,0)),\"\")","v":0.01},{"$f":"IFERROR(IF(B36=\"\",\"\",$C$10*VLOOKUP(B36,Índices!$A:$H,7,0)/VLOOKUP(EDATE($C$8,-1),Índices!$A:$H,7,0)),\"\")","v":210429.68107232169},{"$f":"IFERROR(IF(B36=\"\",\"\",E36*(VLOOKUP(B36,Índices!$A:$H,8,0)-VLOOKUP(EDATE($C$8,-1),Índices!$A:$H,8,0))),\"\")","v":33668.748971570756},null,"1"]
[null,{"$f":"IFERROR(IF(EDATE($C$8,16)>$C$9,\"\",IF(EDATE($C$8,16)>DATE(2099,12,1),\"\",EDATE($C$8,16))),\"\")","v":"2020-03-01"},{"$f":"IFERROR(IF(B37=\"\",\"\",VLOOKUP(B37,Índices!$A:$H,5,0)),\"\")","v":2.0999999999999999E-3},{"$f":"IFERROR(IF(B37=\"\",\"\",VLOOKUP(B37,Índices!$A:$H,6,0)),\"\")","v":0.01},{"$f":"IFERROR(IF(B37=\"\",\"\",$C$10*VLOOKUP(B37,Índices!$A:$H,7,0)/VLOOKUP(EDATE($C$8,-1),Índices!$A:$H,7,0)),\"\")","v":210871.58340257357},{"$f":"IFERROR(IF(B37=\"\",\"\",E37*(VLOOKUP(B37,Índices!$A:$H,8,0)-VLOOKUP(EDATE($C$8,-1),Índices!$A:$H,8,0))),\"\")","v":35848.169178436743},null,"1"]
[null,{"$f":"IFERROR(IF(EDATE($C$8,17)>$C$9,\"\",IF(EDATE($C$8,17)>DATE(2099,12,1),\"\",EDATE($C$8,17))),\"\")","v":"2020-04-01"},{"$f":"IFERROR(IF(B38=\"\",\"\",VLOOKUP(B38,Índices!$A:$H,5,0)),\"\")","v":2.5000000000000001E-3},{"$f":"IFERROR(IF(B38=\"\",\"\",VLOOKUP(B38,Índices!$A:$H,6,0)),\"\")","v":0.01},{"$f":"IFERROR(IF(B38=\"\",\"\",$C$10*VLOOKUP(B38,Índices!$A:$H,7,0)/VLOOKUP(EDATE($C$8,-1),Índices!$A:$H,7,0)),\"\")","v":211398.76236108001},{"$f":"IFERROR(IF(B38=\"\",\"\",E38*(VLOOKUP(B38,Índices!$A:$H,8,0)-VLOOKUP(EDATE($C$8,-1),Índices!$A:$H,8,0))),\"\")","v":38051.777224993588},null,"1"]
[null,{"$f":"IFERROR(IF(EDATE($C$8,18)>$C$9,\"\",IF(EDATE($C$8,18)>DATE(2099,12,1),\"\",EDATE($C$8,18))),\"\")","v":"2020-05-01"},{"$f":"IFERROR(IF(B39=\"\",\"\",VLOOKUP(B39,Índices!$A:$H,5,0)),\"\")","v":6.9999999999999999E-4},{"$f":"IFERROR(IF(B39=\"\",\"\",VLOOKUP(B39,Índices!$A:$H,6,0)),\"\")","v":0.01},{"$f":"IFERROR(IF(B39=\"\",\"\",$C$10*VLOOKUP(B39,Índices!$A:$H,7,0)/VLOOKUP(EDATE($C$8,-1),Índices!$A:$H,7,0)),\"\")","v":211546.74149473276},{"$f":"IFERROR(IF(B39=\"\",\"\",E39*(VLOOKUP(B39,Índices!$A:$H,8,0)-VLOOKUP(EDATE($C$8,-1),Índices!$A:$H,8,0))),\"\")","v":40193.880883998369},null,"1"]
[null,{"$f":"IFERROR(IF(EDATE($C$8,19)>$C$9,\"\",IF(EDATE($C$8,19)>DATE(2099,12,1),\"\",EDATE($C$8,19))),\"\")","v":"2020-06-01"},{"$f":"IFERROR(IF(B40=\"\",\"\",VLOOKUP(B40,Índices!$A:$H,5,0)),\"\")","v":-3.0999999999999999E-3},{"$f":"IFERROR(IF(B40=\"\",\"\",VLOOKUP(B40,Índices!$A:$H,6,0)),\"\")","v":0.01},{"$f":"IFERROR(IF(B40=\"\",\"\",$C$10*VLOOKUP(B40,Índices!$A:$H,7,0)/VLOOKUP(EDATE($C$8,-1),Índices!$A:$H,7,0)),\"\")","v":210890.94659609909},{"$f":"IFERROR(IF(B40=\"\",\"\",E40*(VLOOKUP(B40,Índices!$A:$H,8,0)-VLOOKUP(EDATE($C$8,-1),Índices!$A:$H,8,0))),\"\")","v":42178.189319218916},null,"1"]
[null,{"$f":"IFERROR(IF(EDATE($C$8,20)>$C$9,\"\",IF(EDATE($C$8,20)>DATE(2099,12,1),\"\",EDATE($C$8,20))),\"\")","v":"2020-07-01"},{"$f":"IFERROR(IF(B41=\"\",\"\",VLOOKUP(B41,Índices!$A:$H,5,0)),\"\")","v":-3.8E-3},{"$f":"IFERROR(IF(B41=\"\",\"\",VLOOKUP(B41,Índices!$A:$H,6,0)),\"\")","v":0.01},{"$f":"IFERROR(IF(B41=\"\",\"\",$C$10*VLOOKUP(B41,Índices!$A:$H,7,0)/VLOOKUP(EDATE($C$8,-1),Índices!$A:$H,7,0)),\"\")","v":210089.56099903391},{"$f":"IFERROR(IF(B41=\"\",\"\",E41*(VLOOKUP(B41,Índices!$A:$H,8,0)-VLOOKUP(EDATE($C$8,-1),Índices!$A:$H,8,0))),\"\")","v":44118.807809796184},null,"1"]
[null,{"$f":"IFERROR(IF(EDATE($C$8,21)>$C$9,\"\",IF(EDATE($C$8,21)>DATE(2099,12,1),\"\",EDATE($C$8,21))),\"\")","v":"2020-08-01"},{"$f":"IFERROR(IF(B42=\"\",\"\",VLOOKUP(B42,Índices!$A:$H,5,0)),\"\")","v":2.5999999999999999E-3},{"$f":"IFERROR(IF(B42=\"\",\"\",VLOOKUP(B42,Índices!$A:$H,6,0)),\"\")","v":0.01},{"$f":"IFERROR(IF(B42=\"\",\"\",$C$10*VLOOKUP(B42,Índices!$A:$H,7,0)/VLOOKUP(EDATE($C$8,-1),Índices!$A:$H,7,0)),\"\")","v":210635.79385763139},{"$f":"IFERROR(IF(B42=\"\",\"\",E42*(VLOOKUP(B42,Índices!$A:$H,8,0)-VLOOKUP(EDATE($C$8,-1),Índices!$A:$H,8,0))),\"\")","v":46339.87464867792},null,"1"]
[null,{"$f":"IFERROR(IF(EDATE($C$8,22)>$C$9,\"\",IF(EDATE($C$8,22)>DATE(2099,12,1),\"\",EDATE($C$8,22))),\"\")","v":"2020-09-01"},{"$f":"IFERROR(IF(B43=\"\",\"\",VLOOKUP(B43,Índices!$A:$H,5,0)),\"\")","v":3.5999999999999999E-3},{"$f":"IFERROR(IF(B43=\"\",\"\",VLOOKUP(B43,Índices!$A:$H,6,0)),\"\")","v":0.01},{"$f":"IFERROR(IF(B43=\"\",\"\",$C$10*VLOOKUP(B43,Índices!$A:$H,7,0)/VLOOKUP(EDATE($C$8,-1),Índices!$A:$H,7,0)),\"\")","v":211394.08271551889},{"$f":"IFERROR(IF(B43=\"\",\"\",E43*(VLOOKUP(B43,Índices!$A:$H,8,0)-VLOOKUP(EDATE($C$8,-1),Índices!$A:$H,8,0))),\"\")","v":48620.639024568307},null,"1"]
[null,{"$f":"IFERROR(IF(EDATE($C$8,23)>$C$9,\"\",IF(EDATE($C$8,23)>DATE(2099,12,1),\"\",EDATE($C$8,23))),\"\")","v":"2020-10-01"},{"$f":"IFERROR(IF(B44=\"\",\"\",VLOOKUP(B44,Índices!$A:$H,5,0)),\"\")","v":2.3999999999999998E-3},{"$f":"IFERROR(IF(B44=\"\",\"\",VLOOKUP(B44,Índices!$A:$H,6,0)),\"\")","v":0.01},{"$f":"IFERROR(IF(B44=\"\",\"\",$C$10*VLOOKUP(B44,Índices!$A:$H,7,0)/VLOOKUP(EDATE($C$8,-1),Índices!$A:$H,7,0)),\"\")","v":211901.42851403615},{"$f":"IFERROR(IF(B44=\"\",\"\",E44*(VLOOKUP(B44,Índices!$A:$H,8,0)-VLOOKUP(EDATE($C$8,-1),Índices!$A:$H,8,0))),\"\")","v":50856.342843367594},null,"1"]
[null,{"$f":"IFERROR(IF(EDATE($C$8,24)>$C$9,\"\",IF(EDATE($C$8,24)>DATE(2099,12,1),\"\",EDATE($C$8,24))),\"\")","v":"2020-11-01"},{"$f":"IFERROR(IF(B45=\"\",\"\",VLOOKUP(B45,Índices!$A:$H,5,0)),\"\")","v":6.4000000000000003E-3},{"$f":"IFERROR(IF(B45=\"\",\"\",VLOOKUP(B45,Índices!$A:$H,6,0)),\"\")","v":0.01},{"$f":"IFERROR(IF(B45=\"\",\"\",$C$10*VLOOKUP(B45,Índices!$A:$H,7,0)/VLOOKUP(EDATE($C$8,-1),Índices!$A:$H,7,0)),\"\")","v":213257.59765652596},{"$f":"IFERROR(IF(B45=\"\",\"\",E45*(VLOOKUP(B45,Índices!$A:$H,8,0)-VLOOKUP(EDATE($C$8,-1),Índices!$A:$H,8,0))),\"\")","v":53314.399414130356},null,"1"]
[null,{"$f":"IFERROR(IF(EDATE($C$8,25)>$C$9,\"\",IF(EDATE($C$8,25)>DATE(2099,12,1),\"\",EDATE($C$8,25))),\"\")","v":"2020-12-01"},{"$f":"IFERROR(IF(B46=\"\",\"\",VLOOKUP(B46,Índices!$A:$H,5,0)),\"\")","v":8.6E-3},{"$f":"IFERROR(IF(B46=\"\",\"\",VLOOKUP(B46,Índices!$A:$H,6,0)),\"\")","v":0.01},{"$f":"IFERROR(IF(B46=\"\",\"\",$C$10*VLOOKUP(B46,Índices!$A:$H,7,0)/VLOOKUP(EDATE($C$8,-1),Índices!$A:$H,7,0)),\"\")","v":215091.61299637205},{"$f":"IFERROR(IF(B46=\"\",\"\",E46*(VLOOKUP(B46,Índices!$A:$H,8,0)-VLOOKUP(EDATE($C$8,-1),Índices!$A:$H,8,0))),\"\")","v":55923.819379055538},null,"1"]
[null,{"$f":"IFERROR(IF(EDATE($C$8,26)>$C$9,\"\",IF(EDATE($C$8,26)>DATE(2099,12,1),\"\",EDATE($C$8,26))),\"\")","v":"2021-01-01"},{"$f":"IFERROR(IF(B47=\"\",\"\",VLOOKUP(B47,Índices!$A:$H,5,0)),\"\")","v":8.8999999999999999E-3},{"$f":"IFERROR(IF(B47=\"\",\"\",VLOOKUP(B47,Índices!$A:$H,6,0)),\"\")","v":0.01},{"$f":"IFERROR(IF(B47=\"\",\"\",$C$10*VLOOKUP(B47,Índices!$A:$H,7,0)/VLOOKUP(EDATE($C$8,-1),Índices!$A:$H,7,0)),\"\")","v":217005.92835203971},{"$f":"IFERROR(IF(B47=\"\",\"\",E47*(VLOOKUP(B47,Índices!$A:$H,8,0)-VLOOKUP(EDATE($C$8,-1),Índices!$A:$H,8,0))),\"\")","v":58591.600655049471},null,"1"]
[null,{"$f":"IFERROR(IF(EDATE($C$8,27)>$C$9,\"\",IF(EDATE($C$8,27)>DATE(2099,12,1),\"\",EDATE($C$8,27))),\"\")","v":"2021-02-01"},{"$f":"IFERROR(IF(B48=\"\",\"\",VLOOKUP(B48,Índices!$A:$H,5,0)),\"\")","v":1.35E-2},{"$f":"IFERROR(IF(B48=\"\",\"\",VLOOKUP(B48,Índices!$A:$H,6,0)),\"\")","v":0.01},{"$f":"IFERROR(IF(B48=\"\",\"\",$C$10*VLOOKUP(B48,Índices!$A:$H,7,0)/VLOOKUP(EDATE($C$8,-1),Índices!$A:$H,7,0)),\"\")","v":219935.50838479225},{"$f":"IFERROR(IF(B48=\"\",\"\",E48*(VLOOKUP(B48,Índices!$A:$H,8,0)-VLOOKUP(EDATE($C$8,-1),Índices!$A:$H,8,0))),\"\")","v":61581.942347740514},null,"1"]
[null,{"$f":"IFERROR(IF(EDATE($C$8,28)>$C$9,\"\",IF(EDATE($C$8,28)>DATE(2099,12,1),\"\",EDATE($C$8,28))),\"\")","v":"2021-03-01"},{"$f":"IFERROR(IF(B49=\"\",\"\",VLOOKUP(B49,Índices!$A:$H,5,0)),\"\")","v":2.5000000000000001E-3},{"$f":"IFERROR(IF(B49=\"\",\"\",VLOOKUP(B49,Índices!$A:$H,6,0)),\"\")","v":0.01},{"$f":"IFERROR(IF(B49=\"\",\"\",$C$10*VLOOKUP(B49,Índices!$A:$H,7,0)/VLOOKUP(EDATE($C$8,-1),Índices!$A:$H,7,0)),\"\")","v":220485.34715575425},{"$f":"IFERROR(IF(B49=\"\",\"\",E49*(VLOOKUP(B49,Índices!$A:$H,8,0)-VLOOKUP(EDATE($C$8,-1),Índices!$A:$H,8,0))),\"\")","v":63940.750675167372},null,"1"]
[null,{"$f":"IFERROR(IF(EDATE($C$8,29)>$C$9,\"\",IF(EDATE($C$8,29)>DATE(2099,12,1),\"\",EDATE($C$8,29))),\"\")","v":"2021-04-01"},{"$f":"IFERROR(IF(B50=\"\",\"\",VLOOKUP(B50,Índices!$A:$H,5,0)),\"\")","v":8.6E-3},{"$f":"IFERROR(IF(B50=\"\",\"\",VLOOKUP(B50,Índices!$A:$H,6,0)),\"\")","v":0.01},{"$f":"IFERROR(IF(B50=\"\",\"\",$C$10*VLOOKUP(B50,Índices!$A:$H,7,0)/VLOOKUP(EDATE($C$8,-1),Índices!$A:$H,7,0)),\"\")","v":222381.52114129372},{"$f":"IFERROR(IF(B50=\"\",\"\",E50*(VLOOKUP(B50,Índices!$A:$H,8,0)-VLOOKUP(EDATE($C$8,-1),Índices!$A:$H,8,0))),\"\")","v":66714.456342386693},null,"1"]
[null,{"$f":"IFERROR(IF(EDATE($C$8,30)>$C$9,\"\",IF(EDATE($C$8,30)>DATE(2099,12,1),\"\",EDATE($C$8,30))),\"\")","v":"2021-05-01"},{"$f":"IFERROR(IF(B51=\"\",\"\",VLOOKUP(B51,Índices!$A:$H,5,0)),\"\")","v":9.2999999999999992E-3},{"$f":"IFERROR(IF(B51=\"\",\"\",VLOOKUP(B51,Índices!$A:$H,6,0)),\"\")","v":0.01},{"$f":"IFERROR(IF(B51=\"\",\"\",$C$10*VLOOKUP(B51,Índices!$A:$H,7,0)/VLOOKUP(EDATE($C$8,-1),Índices!$A:$H,7,0)),\"\")","v":224449.66928790777},{"$f":"IFERROR(IF(B51=\"\",\"\",E51*(VLOOKUP(B51,Índices!$A:$H,8,0)-VLOOKUP(EDATE($C$8,-1),Índices!$A:$H,8,0))),\"\")","v":69579.397479249921},null,"1"]
[null,{"$f":"IFERROR(IF(EDATE($C$8,31)>$C$9,\"\",IF(EDATE($C$8,31)>DATE(2099,12,1),\"\",EDATE($C$8,31))),\"\")","v":"2021-06-01"},{"$f":"IFERROR(IF(B52=\"\",\"\",VLOOKUP(B52,Índices!$A:$H,5,0)),\"\")","v":3.0999999999999999E-3},{"$f":"IFERROR(IF(B52=\"\",\"\",VLOOKUP(B52,Índices!$A:$H,6,0)),\"\")","v":0.01},{"$f":"IFERROR(IF(B52=\"\",\"\",$C$10*VLOOKUP(B52,Índices!$A:$H,7,0)/VLOOKUP(EDATE($C$8,-1),Índices!$A:$H,7,0)),\"\")","v":225145.4632627003},{"$f":"IFERROR(IF(B52=\"\",\"\",E52*(VLOOKUP(B52,Índices!$A:$H,8,0)-VLOOKUP(EDATE($C$8,-1),Índices!$A:$H,8,0))),\"\")","v":72046.548244062564},null,"1"]
[null,{"$f":"IFERROR(IF(EDATE($C$8,32)>$C$9,\"\",IF(EDATE($C$8,32)>DATE(2099,12,1),\"\",EDATE($C$8,32))),\"\")","v":"2021-07-01"},{"$f":"IFERROR(IF(B53=\"\",\"\",VLOOKUP(B53,Índices!$A:$H,5,0)),\"\")","v":8.3000000000000001E-3},{"$f":"IFERROR(IF(B53=\"\",\"\",VLOOKUP(B53,Índices!$A:$H,6,0)),\"\")","v":0.01},{"$f":"IFERROR(IF(B53=\"\",\"\",$C$10*VLOOKUP(B53,Índices!$A:$H,7,0)/VLOOKUP(EDATE($C$8,-1),Índices!$A:$H,7,0)),\"\")","v":227014.17060778069},{"$f":"IFERROR(IF(B53=\"\",\"\",E53*(VLOOKUP(B53,Índices!$A:$H,8,0)-VLOOKUP(EDATE($C$8,-1),Índices!$A:$H,8,0))),\"\")","v":74914.676300566032},null,"1"]
[null,{"$f":"IFERROR(IF(EDATE($C$8,33)>$C$9,\"\",IF(EDATE($C$8,33)>DATE(2099,12,1),\"\",EDATE($C$8,33))),\"\")","v":"2021-08-01"},{"$f":"IFERROR(IF(B54=\"\",\"\",VLOOKUP(B54,Índices!$A:$H,5,0)),\"\")","v":5.3E-3},{"$f":"IFERROR(IF(B54=\"\",\"\",VLOOKUP(B54,Índices!$A:$H,6,0)),\"\")","v":0.01},{"$f":"IFERROR(IF(B54=\"\",\"\",$C$10*VLOOKUP(B54,Índices!$A:$H,7,0)/VLOOKUP(EDATE($C$8,-1),Índices!$A:$H,7,0)),\"\")","v":228217.34571200193},{"$f":"IFERROR(IF(B54=\"\",\"\",E54*(VLOOKUP(B54,Índices!$A:$H,8,0)-VLOOKUP(EDATE($C$8,-1),Índices!$A:$H,8,0))),\"\")","v":77593.897542079008},null,"1"]
[null,{"$f":"IFERROR(IF(EDATE($C$8,34)>$C$9,\"\",IF(EDATE($C$8,34)>DATE(2099,12,1),\"\",EDATE($C$8,34))),\"\")","v":"2021-09-01"},{"$f":"IFERROR(IF(B55=\"\",\"\",VLOOKUP(B55,Índices!$A:$H,5,0)),\"\")","v":9.5999999999999992E-3},{"$f":"IFERROR(IF(B55=\"\",\"\",VLOOKUP(B55,Índices!$A:$H,6,0)),\"\")","v":0.01},{"$f":"IFERROR(IF(B55=\"\",\"\",$C$10*VLOOKUP(B55,Índices!$A:$H,7,0)/VLOOKUP(EDATE($C$8,-1),Índices!$A:$H,7,0)),\"\")","v":230408.23223083717},{"$f":"IFERROR(IF(B55=\"\",\"\",E55*(VLOOKUP(B55,Índices!$A:$H,8,0)-VLOOKUP(EDATE($C$8,-1),Índices!$A:$H,8,0))),\"\")","v":80642.881280791291},null,"1"]
[null,{"$f":"IFERROR(IF(EDATE($C$8,35)>$C$9,\"\",IF(EDATE($C$8,35)>DATE(2099,12,1),\"\",EDATE($C$8,35))),\"\")","v":"2021-10-01"},{"$f":"IFERROR(IF(B56=\"\",\"\",VLOOKUP(B56,Índices!$A:$H,5,0)),\"\")","v":8.6999999999999994E-3},{"$f":"IFERROR(IF(B56=\"\",\"\",VLOOKUP(B56,Índices!$A:$H,6,0)),\"\")","v":0.01},{"$f":"IFERROR(IF(B56=\"\",\"\",$C$10*VLOOKUP(B56,Índices!$A:$H,7,0)/VLOOKUP(EDATE($C$8,-1),Índices!$A:$H,7,0)),\"\")","v":232412.78385124542},{"$f":"IFERROR(IF(B56=\"\",\"\",E56*(VLOOKUP(B56,Índices!$A:$H,8,0)-VLOOKUP(EDATE($C$8,-1),Índices!$A:$H,8,0))),\"\")","v":83668.602186446573},null,"1"]
[null,{"$f":"IFERROR(IF(EDATE($C$8,36)>$C$9,\"\",IF(EDATE($C$8,36)>DATE(2099,12,1),\"\",EDATE($C$8,36))),\"\")","v":"2021-11-01"},{"$f":"IFERROR(IF(B57=\"\",\"\",VLOOKUP(B57,Índices!$A:$H,5,0)),\"\")","v":1.1599999999999999E-2},{"$f":"IFERROR(IF(B57=\"\",\"\",VLOOKUP(B57,Índices!$A:$H,6,0)),\"\")","v":0.01},{"$f":"IFERROR(IF(B57=\"\",\"\",$C$10*VLOOKUP(B57,Índices!$A:$H,7,0)/VLOOKUP(EDATE($C$8,-1),Índices!$A:$H,7,0)),\"\")","v":235108.77214391992},{"$f":"IFERROR(IF(B57=\"\",\"\",E57*(VLOOKUP(B57,Índices!$A:$H,8,0)-VLOOKUP(EDATE($C$8,-1),Índices!$A:$H,8,0))),\"\")","v":86990.245693248522},null,"1"]
[null,{"$f":"IFERROR(IF(EDATE($C$8,37)>$C$9,\"\",IF(EDATE($C$8,37)>DATE(2099,12,1),\"\",EDATE($C$8,37))),\"\")","v":"2021-12-01"},{"$f":"IFERROR(IF(B58=\"\",\"\",VLOOKUP(B58,Índices!$A:$H,5,0)),\"\")","v":1.2500000000000001E-2},{"$f":"IFERROR(IF(B58=\"\",\"\",VLOOKUP(B58,Índices!$A:$H,6,0)),\"\")","v":0.01},{"$f":"IFERROR(IF(B58=\"\",\"\",$C$10*VLOOKUP(B58,Índices!$A:$H,7,0)/VLOOKUP(EDATE($C$8,-1),Índices!$A:$H,7,0)),\"\")","v":238047.63179571886},{"$f":"IFERROR(IF(B58=\"\",\"\",E58*(VLOOKUP(B58,Índices!$A:$H,8,0)-VLOOKUP(EDATE($C$8,-1),Índices!$A:$H,8,0))),\"\")","v":90458.100082371238},null,"1"]
[null,{"$f":"IFERROR(IF(EDATE($C$8,38)>$C$9,\"\",IF(EDATE($C$8,38)>DATE(2099,12,1),\"\",EDATE($C$8,38))),\"\")","v":"2022-01-01"},{"$f":"IFERROR(IF(B59=\"\",\"\",VLOOKUP(B59,Índices!$A:$H,5,0)),\"\")","v":9.4999999999999998E-3},{"$f":"IFERROR(IF(B59=\"\",\"\",VLOOKUP(B59,Índices!$A:$H,6,0)),\"\")","v":0.01},{"$f":"IFERROR(IF(B59=\"\",\"\",$C$10*VLOOKUP(B59,Índices!$A:$H,7,0)/VLOOKUP(EDATE($C$8,-1),Índices!$A:$H,7,0)),\"\")","v":240309.08429777823},{"$f":"IFERROR(IF(B59=\"\",\"\",E59*(VLOOKUP(B59,Índices!$A:$H,8,0)-VLOOKUP(EDATE($C$8,-1),Índices!$A:$H,8,0))),\"\")","v":93720.542876131512},null,"1"]
[null,{"$f":"IFERROR(IF(EDATE($C$8,39)>$C$9,\"\",IF(EDATE($C$8,39)>DATE(2099,12,1),\"\",EDATE($C$8,39))),\"\")","v":"2022-02-01"},{"$f":"IFERROR(IF(B60=\"\",\"\",VLOOKUP(B60,Índices!$A:$H,5,0)),\"\")","v":7.3000000000000001E-3},{"$f":"IFERROR(IF(B60=\"\",\"\",VLOOKUP(B60,Índices!$A:$H,6,0)),\"\")","v":0.01},{"$f":"IFERROR(IF(B60=\"\",\"\",$C$10*VLOOKUP(B60,Índices!$A:$H,7,0)/VLOOKUP(EDATE($C$8,-1),Índices!$A:$H,7,0)),\"\")","v":242063.34061315202},{"$f":"IFERROR(IF(B60=\"\",\"\",E60*(VLOOKUP(B60,Índices!$A:$H,8,0)-VLOOKUP(EDATE($C$8,-1),Índices!$A:$H,8,0))),\"\")","v":96825.336245258746},null,"1"]
[null,{"$f":"IFERROR(IF(EDATE($C$8,40)>$C$9,\"\",IF(EDATE($C$8,40)>DATE(2099,12,1),\"\",EDATE($C$8,40))),\"\")","v":"2022-03-01"},{"$f":"IFERROR(IF(B61=\"\",\"\",VLOOKUP(B61,Índices!$A:$H,5,0)),\"\")","v":5.4000000000000003E-3},{"$f":"IFERROR(IF(B61=\"\",\"\",VLOOKUP(B61,Índices!$A:$H,6,0)),\"\")","v":0.01},{"$f":"IFERROR(IF(B61=\"\",\"\",$C$10*VLOOKUP(B61,Índices!$A:$H,7,0)/VLOOKUP(EDATE($C$8,-1),Índices!$A:$H,7,0)),\"\")","v":243370.48265246308},{"$f":"IFERROR(IF(B61=\"\",\"\",E61*(VLOOKUP(B61,Índices!$A:$H,8,0)-VLOOKUP(EDATE($C$8,-1),Índices!$A:$H,8,0))),\"\")","v":99781.89788750773},null,"1"]
[null,{"$f":"IFERROR(IF(EDATE($C$8,41)>$C$9,\"\",IF(EDATE($C$8,41)>DATE(2099,12,1),\"\",EDATE($C$8,41))),\"\")","v":"2022-04-01"},{"$f":"IFERROR(IF(B62=\"\",\"\",VLOOKUP(B62,Índices!$A:$H,5,0)),\"\")","v":1.01E-2},{"$f":"IFERROR(IF(B62=\"\",\"\",VLOOKUP(B62,Índices!$A:$H,6,0)),\"\")","v":0.01},{"$f":"IFERROR(IF(B62=\"\",\"\",$C$10*VLOOKUP(B62,Índices!$A:$H,7,0)/VLOOKUP(EDATE($C$8,-1),Índices!$A:$H,7,0)),\"\")","v":245828.52452725294},{"$f":"IFERROR(IF(B62=\"\",\"\",E62*(VLOOKUP(B62,Índices!$A:$H,8,0)-VLOOKUP(EDATE($C$8,-1),Índices!$A:$H,8,0))),\"\")","v":103247.98030144404},null,"1"]
[null,{"$f":"IFERROR(IF(EDATE($C$8,42)>$C$9,\"\",IF(EDATE($C$8,42)>DATE(2099,12,1),\"\",EDATE($C$8,42))),\"\")","v":"2022-05-01"},{"$f":"IFERROR(IF(B63=\"\",\"\",VLOOKUP(B63,Índices!$A:$H,5,0)),\"\")","v":1.6199999999999999E-2},{"$f":"IFERROR(IF(B63=\"\",\"\",VLOOKUP(B63,Índices!$A:$H,6,0)),\"\")","v":0.01},{"$f":"IFERROR(IF(B63=\"\",\"\",$C$10*VLOOKUP(B63,Índices!$A:$H,7,0)/VLOOKUP(EDATE($C$8,-1),Índices!$A:$H,7,0)),\"\")","v":249810.94662459445},{"$f":"IFERROR(IF(B63=\"\",\"\",E63*(VLOOKUP(B63,Índices!$A:$H,8,0)-VLOOKUP(EDATE($C$8,-1),Índices!$A:$H,8,0))),\"\")","v":107418.70704857333},null,"1"]
[null,{"$f":"IFERROR(IF(EDATE($C$8,43)>$C$9,\"\",IF(EDATE($C$8,43)>DATE(2099,12,1),\"\",EDATE($C$8,43))),\"\")","v":"2022-06-01"},{"$f":"IFERROR(IF(B64=\"\",\"\",VLOOKUP(B64,Índices!$A:$H,5,0)),\"\")","v":1.06E-2},{"$f":"IFERROR(IF(B64=\"\",\"\",VLOOKUP(B64,Índices!$A:$H,6,0)),\"\")","v":0.01},{"$f":"IFERROR(IF(B64=\"\",\"\",$C$10*VLOOKUP(B64,Índices!$A:$H,7,0)/VLOOKUP(EDATE($C$8,-1),Índices!$A:$H,7,0)),\"\")","v":252458.94265881513},{"$f":"IFERROR(IF(B64=\"\",\"\",E64*(VLOOKUP(B64,Índices!$A:$H,8,0)-VLOOKUP(EDATE($C$8,-1),Índices!$A:$H,8,0))),\"\")","v":111081.93476987629},null,"1"]
[null,{"$f":"IFERROR(IF(EDATE($C$8,44)>$C$9,\"\",IF(EDATE($C$8,44)>DATE(2099,12,1),\"\",EDATE($C$8,44))),\"\")","v":"2022-07-01"},{"$f":"IFERROR(IF(B65=\"\",\"\",VLOOKUP(B65,Índices!$A:$H,5,0)),\"\")","v":4.7000000000000002E-3},{"$f":"IFERROR(IF(B65=\"\",\"\",VLOOKUP(B65,Índices!$A:$H,6,0)),\"\")","v":0.01},{"$f":"IFERROR(IF(B65=\"\",\"\",$C$10*VLOOKUP(B65,Índices!$A:$H,7,0)/VLOOKUP(EDATE($C$8,-1),Índices!$A:$H,7,0)),\"\")","v":253645.49968931155},{"$f":"IFERROR(IF(B65=\"\",\"\",E65*(VLOOKUP(B65,Índices!$A:$H,8,0)-VLOOKUP(EDATE($C$8,-1),Índices!$A:$H,8,0))),\"\")","v":114140.47486018777},null,"1"]
[null,{"$f":"IFERROR(IF(EDATE($C$8,45)>$C$9,\"\",IF(EDATE($C$8,45)>DATE(2099,12,1),\"\",EDATE($C$8,45))),\"\")","v":"2022-08-01"},{"$f":"IFERROR(IF(B66=\"\",\"\",VLOOKUP(B66,Índices!$A:$H,5,0)),\"\")","v":6.7000000000000002E-3},{"$f":"IFERROR(IF(B66=\"\",\"\",VLOOKUP(B66,Índices!$A:$H,6,0)),\"\")","v":0.01},{"$f":"IFERROR(IF(B66=\"\",\"\",$C$10*VLOOKUP(B66,Índices!$A:$H,7,0)/VLOOKUP(EDATE($C$8,-1),Índices!$A:$H,7,0)),\"\")","v":255344.9245372299},{"$f":"IFERROR(IF(B66=\"\",\"\",E66*(VLOOKUP(B66,Índices!$A:$H,8,0)-VLOOKUP(EDATE($C$8,-1),Índices!$A:$H,8,0))),\"\")","v":117458.66528712325},null,"1"]
[null,{"$f":"IFERROR(IF(EDATE($C$8,46)>$C$9,\"\",IF(EDATE($C$8,46)>DATE(2099,12,1),\"\",EDATE($C$8,46))),\"\")","v":"2022-09-01"},{"$f":"IFERROR(IF(B67=\"\",\"\",VLOOKUP(B67,Índices!$A:$H,5,0)),\"\")","v":-6.7999999999999996E-3},{"$f":"IFERROR(IF(B67=\"\",\"\",VLOOKUP(B67,Índices!$A:$H,6,0)),\"\")","v":0.01},{"$f":"IFERROR(IF(B67=\"\",\"\",$C$10*VLOOKUP(B67,Índices!$A:$H,7,0)/VLOOKUP(EDATE($C$8,-1),Índices!$A:$H,7,0)),\"\")","v":253608.57905037675},{"$f":"IFERROR(IF(B67=\"\",\"\",E67*(VLOOKUP(B67,Índices!$A:$H,8,0)-VLOOKUP(EDATE($C$8,-1),Índices!$A:$H,8,0))),\"\")","v":119196.03215367453},null,"1"]
[null,{"$f":"IFERROR(IF(EDATE($C$8,47)>$C$9,\"\",IF(EDATE($C$8,47)>DATE(2099,12,1),\"\",EDATE($C$8,47))),\"\")","v":"2022-10-01"},{"$f":"IFERROR(IF(B68=\"\",\"\",VLOOKUP(B68,Índices!$A:$H,5,0)),\"\")","v":-3.5999999999999999E-3},{"$f":"IFERROR(IF(B68=\"\",\"\",VLOOKUP(B68,Índices!$A:$H,6,0)),\"\")","v":0.01},{"$f":"IFERROR(IF(B68=\"\",\"\",$C$10*VLOOKUP(B68,Índices!$A:$H,7,0)/VLOOKUP(EDATE($C$8,-1),Índices!$A:$H,7,0)),\"\")","v":252695.58816579537},{"$f":"IFERROR(IF(B68=\"\",\"\",E68*(VLOOKUP(B68,Índices!$A:$H,8,0)-VLOOKUP(EDATE($C$8,-1),Índices!$A:$H,8,0))),\"\")","v":121293.88231957919},null,"1"]
[null,{"$f":"IFERROR(IF(EDATE($C$8,48)>$C$9,\"\",IF(EDATE($C$8,48)>DATE(2099,12,1),\"\",EDATE($C$8,48))),\"\")","v":"2022-11-01"},{"$f":"IFERROR(IF(B69=\"\",\"\",VLOOKUP(B69,Índices!$A:$H,5,0)),\"\")","v":-2.8999999999999998E-3},{"$f":"IFERROR(IF(B69=\"\",\"\",VLOOKUP(B69,Índices!$A:$H,6,0)),\"\")","v":0.01},{"$f":"IFERROR(IF(B69=\"\",\"\",$C$10*VLOOKUP(B69,Índices!$A:$H,7,0)/VLOOKUP(EDATE($C$8,-1),Índices!$A:$H,7,0)),\"\")","v":251962.77096011455},{"$f":"IFERROR(IF(B69=\"\",\"\",E69*(VLOOKUP(B69,Índices!$A:$H,8,0)-VLOOKUP(EDATE($C$8,-1),Índices!$A:$H,8,0))),\"\")","v":123461.75777045349},null,"1"]
[null,{"$f":"IFERROR(IF(EDATE($C$8,49)>$C$9,\"\",IF(EDATE($C$8,49)>DATE(2099,12,1),\"\",EDATE($C$8,49))),\"\")","v":"2022-12-01"},{"$f":"IFERROR(IF(B70=\"\",\"\",VLOOKUP(B70,Índices!$A:$H,5,0)),\"\")","v":5.8999999999999999E-3},{"$f":"IFERROR(IF(B70=\"\",\"\",VLOOKUP(B70,Índices!$A:$H,6,0)),\"\")","v":0.01},{"$f":"IFERROR(IF(B70=\"\",\"\",$C$10*VLOOKUP(B70,Índices!$A:$H,7,0)/VLOOKUP(EDATE($C$8,-1),Índices!$A:$H,7,0)),\"\")","v":253449.35130877921},{"$f":"IFERROR(IF(B70=\"\",\"\",E70*(VLOOKUP(B70,Índices!$A:$H,8,0)-VLOOKUP(EDATE($C$8,-1),Índices!$A:$H,8,0))),\"\")","v":126724.6756543869},null,"1"]
[null,{"$f":"IFERROR(IF(EDATE($C$8,50)>$C$9,\"\",IF(EDATE($C$8,50)>DATE(2099,12,1),\"\",EDATE($C$8,50))),\"\")","v":"2023-01-01"},{"$f":"IFERROR(IF(B71=\"\",\"\",VLOOKUP(B71,Índices!$A:$H,5,0)),\"\")","v":4.1000000000000003E-3},{"$f":"IFERROR(IF(B71=\"\",\"\",VLOOKUP(B71,Índices!$A:$H,6,0)),\"\")","v":0.01},{"$f":"IFERROR(IF(B71=\"\",\"\",$C$10*VLOOKUP(B71,Índices!$A:$H,7,0)/VLOOKUP(EDATE($C$8,-1),Índices!$A:$H,7,0)),\"\")","v":254488.49364914518},{"$f":"IFERROR(IF(B71=\"\",\"\",E71*(VLOOKUP(B71,Índices!$A:$H,8,0)-VLOOKUP(EDATE($C$8,-1),Índices!$A:$H,8,0))),\"\")","v":129789.13176106128},null,"1"]
[null,{"$f":"IFERROR(IF(EDATE($C$8,51)>$C$9,\"\",IF(EDATE($C$8,51)>DATE(2099,12,1),\"\",EDATE($C$8,51))),\"\")","v":"2023-02-01"},{"$f":"IFERROR(IF(B72=\"\",\"\",VLOOKUP(B72,Índices!$A:$H,5,0)),\"\")","v":6.1999999999999998E-3},{"$f":"IFERROR(IF(B72=\"\",\"\",VLOOKUP(B72,Índices!$A:$H,6,0)),\"\")","v":0.01},{"$f":"IFERROR(IF(B72=\"\",\"\",$C$10*VLOOKUP(B72,Índices!$A:$H,7,0)/VLOOKUP(EDATE($C$8,-1),Índices!$A:$H,7,0)),\"\")","v":256066.32230976986},{"$f":"IFERROR(IF(B72=\"\",\"\",E72*(VLOOKUP(B72,Índices!$A:$H,8,0)-VLOOKUP(EDATE($C$8,-1),Índices!$A:$H,8,0))),\"\")","v":133154.4876010775},null,"1"]
[null,{"$f":"IFERROR(IF(EDATE($C$8,52)>$C$9,\"\",IF(EDATE($C$8,52)>DATE(2099,12,1),\"\",EDATE($C$8,52))),\"\")","v":"2023-03-01"},{"$f":"IFERROR(IF(B73=\"\",\"\",VLOOKUP(B73,Índices!$A:$H,5,0)),\"\")","v":5.3E-3},{"$f":"IFERROR(IF(B73=\"\",\"\",VLOOKUP(B73,Índices!$A:$H,6,0)),\"\")","v":0.01},{"$f":"IFERROR(IF(B73=\"\",\"\",$C$10*VLOOKUP(B73,Índices!$A:$H,7,0)/VLOOKUP(EDATE($C$8,-1),Índices!$A:$H,7,0)),\"\")","v":257423.4738180117},{"$f":"IFERROR(IF(B73=\"\",\"\",E73*(VLOOKUP(B73,Índices!$A:$H,8,0)-VLOOKUP(EDATE($C$8,-1),Índices!$A:$H,8,0))),\"\")","v":136434.44112354328},null,"1"]
[null,{"$f":"IFERROR(IF(EDATE($C$8,53)>$C$9,\"\",IF(EDATE($C$8,53)>DATE(2099,12,1),\"\",EDATE($C$8,53))),\"\")","v":"2023-04-01"},{"$f":"IFERROR(IF(B74=\"\",\"\",VLOOKUP(B74,Índices!$A:$H,5,0)),\"\")","v":8.3999999999999995E-3},{"$f":"IFERROR(IF(B74=\"\",\"\",VLOOKUP(B74,Índices!$A:$H,6,0)),\"\")","v":0.01},{"$f":"IFERROR(IF(B74=\"\",\"\",$C$10*VLOOKUP(B74,Índices!$A:$H,7,0)/VLOOKUP(EDATE($C$8,-1),Índices!$A:$H,7,0)),\"\")","v":259585.83099808299},{"$f":"IFERROR(IF(B74=\"\",\"\",E74*(VLOOKUP(B74,Índices!$A:$H,8,0)-VLOOKUP(EDATE($C$8,-1),Índices!$A:$H,8,0))),\"\")","v":140176.34873896182},null,"1"]
[null,{"$f":"IFERROR(IF(EDATE($C$8,54)>$C$9,\"\",IF(EDATE($C$8,54)>DATE(2099,12,1),\"\",EDATE($C$8,54))),\"\")","v":"2023-05-01"},{"$f":"IFERROR(IF(B75=\"\",\"\",VLOOKUP(B75,Índices!$A:$H,5,0)),\"\")","v":7.1000000000000004E-3},{"$f":"IFERROR(IF(B75=\"\",\"\",VLOOKUP(B75,Índices!$A:$H,6,0)),\"\")","v":0.01},{"$f":"IFERROR(IF(B75=\"\",\"\",$C$10*VLOOKUP(B75,Índices!$A:$H,7,0)/VLOOKUP(EDATE($C$8,-1),Índices!$A:$H,7,0)),\"\")","v":261428.89039816937},{"$f":"IFERROR(IF(B75=\"\",\"\",E75*(VLOOKUP(B75,Índices!$A:$H,8,0)-VLOOKUP(EDATE($C$8,-1),Índices!$A:$H,8,0))),\"\")","v":143785.8897189901},null,"1"]
[null,{"$f":"IFERROR(IF(EDATE($C$8,55)>$C$9,\"\",IF(EDATE($C$8,55)>DATE(2099,12,1),\"\",EDATE($C$8,55))),\"\")","v":"2023-06-01"},{"$f":"IFERROR(IF(B76=\"\",\"\",VLOOKUP(B76,Índices!$A:$H,5,0)),\"\")","v":6.1000000000000004E-3},{"$f":"IFERROR(IF(B76=\"\",\"\",VLOOKUP(B76,Índices!$A:$H,6,0)),\"\")","v":0.01},{"$f":"IFERROR(IF(B76=\"\",\"\",$C$10*VLOOKUP(B76,Índices!$A:$H,7,0)/VLOOKUP(EDATE($C$8,-1),Índices!$A:$H,7,0)),\"\")","v":263023.60662959825},{"$f":"IFERROR(IF(B76=\"\",\"\",E76*(VLOOKUP(B76,Índices!$A:$H,8,0)-VLOOKUP(EDATE($C$8,-1),Índices!$A:$H,8,0))),\"\")","v":147293.21971257188},null,"1"]
[null,{"$f":"IFERROR(IF(EDATE($C$8,56)>$C$9,\"\",IF(EDATE($C$8,56)>DATE(2099,12,1),\"\",EDATE($C$8,56))),\"\")","v":"2023-07-01"},{"$f":"IFERROR(IF(B77=\"\",\"\",VLOOKUP(B77,Índices!$A:$H,5,0)),\"\")","v":2.3E-3},{"$f":"IFERROR(IF(B77=\"\",\"\",VLOOKUP(B77,Índices!$A:$H,6,0)),\"\")","v":0.01},{"$f":"IFERROR(IF(B77=\"\",\"\",$C$10*VLOOKUP(B77,Índices!$A:$H,7,0)/VLOOKUP(EDATE($C$8,-1),Índices!$A:$H,7,0)),\"\")","v":263628.56092484633},{"$f":"IFERROR(IF(B77=\"\",\"\",E77*(VLOOKUP(B77,Índices!$A:$H,8,0)-VLOOKUP(EDATE($C$8,-1),Índices!$A:$H,8,0))),\"\")","v":150268.27972715921},null,"1"]
[null,{"$f":"IFERROR(IF(EDATE($C$8,57)>$C$9,\"\",IF(EDATE($C$8,57)>DATE(2099,12,1),\"\",EDATE($C$8,57))),\"\")","v":"2023-08-01"},{"$f":"IFERROR(IF(B78=\"\",\"\",VLOOKUP(B78,Índices!$A:$H,5,0)),\"\")","v":-8.0000000000000004E-4},{"$f":"IFERROR(IF(B78=\"\",\"\",VLOOKUP(B78,Índices!$A:$H,6,0)),\"\")","v":0.01},{"$f":"IFERROR(IF(B78=\"\",\"\",$C$10*VLOOKUP(B78,Índices!$A:$H,7,0)/VLOOKUP(EDATE($C$8,-1),Índices!$A:$H,7,0)),\"\")","v":263417.6580761064},{"$f":"IFERROR(IF(B78=\"\",\"\",E78*(VLOOKUP(B78,Índices!$A:$H,8,0)-VLOOKUP(EDATE($C$8,-1),Índices!$A:$H,8,0))),\"\")","v":152782.24168413845},null,"1"]
[null,{"$f":"IFERROR(IF(EDATE($C$8,58)>$C$9,\"\",IF(EDATE($C$8,58)>DATE(2099,12,1),\"\",EDATE($C$8,58))),\"\")","v":"2023-09-01"},{"$f":"IFERROR(IF(B79=\"\",\"\",VLOOKUP(B79,Índices!$A:$H,5,0)),\"\")","v":1.1999999999999999E-3},{"$f":"IFERROR(IF(B79=\"\",\"\",VLOOKUP(B79,Índices!$A:$H,6,0)),\"\")","v":0.01},{"$f":"IFERROR(IF(B79=\"\",\"\",$C$10*VLOOKUP(B79,Índices!$A:$H,7,0)/VLOOKUP(EDATE($C$8,-1),Índices!$A:$H,7,0)),\"\")","v":263733.75926579774},{"$f":"IFERROR(IF(B79=\"\",\"\",E79*(VLOOKUP(B79,Índices!$A:$H,8,0)-VLOOKUP(EDATE($C$8,-1),Índices!$A:$H,8,0))),\"\")","v":155602.91796681736},null,"1"]
[null,{"$f":"IFERROR(IF(EDATE($C$8,59)>$C$9,\"\",IF(EDATE($C$8,59)>DATE(2099,12,1),\"\",EDATE($C$8,59))),\"\")","v":"2023-10-01"},{"$f":"IFERROR(IF(B80=\"\",\"\",VLOOKUP(B80,Índices!$A:$H,5,0)),\"\")","v":2.3E-3},{"$f":"IFERROR(IF(B80=\"\",\"\",VLOOKUP(B80,Índices!$A:$H,6,0)),\"\")","v":7.4000000000000003E-3},{"$f":"IFERROR(IF(B80=\"\",\"\",$C$10*VLOOKUP(B80,Índices!$A:$H,7,0)/VLOOKUP(EDATE($C$8,-1),Índices!$A:$H,7,0)),\"\")","v":264340.34691210906},{"$f":"IFERROR(IF(B80=\"\",\"\",E80*(VLOOKUP(B80,Índices!$A:$H,8,0)-VLOOKUP(EDATE($C$8,-1),Índices!$A:$H,8,0))),\"\")","v":157916.92324529064},null,"1"]
[null,{"$f":"IFERROR(IF(EDATE($C$8,60)>$C$9,\"\",IF(EDATE($C$8,60)>DATE(2099,12,1),\"\",EDATE($C$8,60))),\"\")","v":"2023-11-01"},{"$f":"IFERROR(IF(B81=\"\",\"\",VLOOKUP(B81,Índices!$A:$H,5,0)),\"\")","v":2.5999999999999999E-3},{"$f":"IFERROR(IF(B81=\"\",\"\",VLOOKUP(B81,Índices!$A:$H,6,0)),\"\")","v":7.4000000000000003E-3},{"$f":"IFERROR(IF(B81=\"\",\"\",$C$10*VLOOKUP(B81,Índices!$A:$H,7,0)/VLOOKUP(EDATE($C$8,-1),Índices!$A:$H,7,0)),\"\")","v":265027.63181408052},{"$f":"IFERROR(IF(B81=\"\",\"\",E81*(VLOOKUP(B81,Índices!$A:$H,8,0)-VLOOKUP(EDATE($C$8,-1),Índices!$A:$H,8,0))),\"\")","v":160288.71172115262},null,"1"]
[null,{"$f":"IFERROR(IF(EDATE($C$8,61)>$C$9,\"\",IF(EDATE($C$8,61)>DATE(2099,12,1),\"\",EDATE($C$8,61))),\"\")","v":"2023-12-01"},{"$f":"IFERROR(IF(B82=\"\",\"\",VLOOKUP(B82,Índices!$A:$H,5,0)),\"\")","v":2.3999999999999998E-3},{"$f":"IFERROR(IF(B82=\"\",\"\",VLOOKUP(B82,Índices!$A:$H,6,0)),\"\")","v":6.8000000000000005E-3},{"$f":"IFERROR(IF(B82=\"\",\"\",$C$10*VLOOKUP(B82,Índices!$A:$H,7,0)/VLOOKUP(EDATE($C$8,-1),Índices!$A:$H,7,0)),\"\")","v":265663.69813043432},{"$f":"IFERROR(IF(B82=\"\",\"\",E82*(VLOOKUP(B82,Índices!$A:$H,8,0)-VLOOKUP(EDATE($C$8,-1),Índices!$A:$H,8,0))),\"\")","v":162479.91777657036},null,"1"]
[null,{"$f":"IFERROR(IF(EDATE($C$8,62)>$C$9,\"\",IF(EDATE($C$8,62)>DATE(2099,12,1),\"\",EDATE($C$8,62))),\"\")","v":"2024-01-01"},{"$f":"IFERROR(IF(B83=\"\",\"\",VLOOKUP(B83,Índices!$A:$H,5,0)),\"\")","v":2.8E-3},{"$f":"IFERROR(IF(B83=\"\",\"\",VLOOKUP(B83,Índices!$A:$H,6,0)),\"\")","v":6.0999999999999995E-3},{"$f":"IFERROR(IF(B83=\"\",\"\",$C$10*VLOOKUP(B83,Índices!$A:$H,7,0)/VLOOKUP(EDATE($C$8,-1),Índices!$A:$H,7,0)),\"\")","v":266407.55648519949},{"$f":"IFERROR(IF(B83=\"\",\"\",E83*(VLOOKUP(B83,Índices!$A:$H,8,0)-VLOOKUP(EDATE($C$8,-1),Índices!$A:$H,8,0))),\"\")","v":164559.94764090446},null,"1"]
[null,{"$f":"IFERROR(IF(EDATE($C$8,63)>$C$9,\"\",IF(EDATE($C$8,63)>DATE(2099,12,1),\"\",EDATE($C$8,63))),\"\")","v":"2024-02-01"},{"$f":"IFERROR(IF(B84=\"\",\"\",VLOOKUP(B84,Índices!$A:$H,5,0)),\"\")","v":5.5999999999999999E-3},{"$f":"IFERROR(IF(B84=\"\",\"\",VLOOKUP(B84,Índices!$A:$H,6,0)),\"\")","v":4.1000000000000003E-3},{"$f":"IFERROR(IF(B84=\"\",\"\",$C$10*VLOOKUP(B84,Índices!$A:$H,7,0)/VLOOKUP(EDATE($C$8,-1),Índices!$A:$H,7,0)),\"\")","v":267899.43880151666},{"$f":"IFERROR(IF(B84=\"\",\"\",E84*(VLOOKUP(B84,Índices!$A:$H,8,0)-VLOOKUP(EDATE($C$8,-1),Índices!$A:$H,8,0))),\"\")","v":166579.87104677982},null,"1"]
[null,{"$f":"IFERROR(IF(EDATE($C$8,64)>$C$9,\"\",IF(EDATE($C$8,64)>DATE(2099,12,1),\"\",EDATE($C$8,64))),\"\")","v":"2024-03-01"},{"$f":"IFERROR(IF(B85=\"\",\"\",VLOOKUP(B85,Índices!$A:$H,5,0)),\"\")","v":4.1999999999999997E-3},{"$f":"IFERROR(IF(B85=\"\",\"\",VLOOKUP(B85,Índices!$A:$H,6,0)),\"\")","v":3.8000000000000004E-3},{"$f":"IFERROR(IF(B85=\"\",\"\",$C$10*VLOOKUP(B85,Índices!$A:$H,7,0)/VLOOKUP(EDATE($C$8,-1),Índices!$A:$H,7,0)),\"\")","v":269024.61644448299},{"$f":"IFERROR(IF(B85=\"\",\"\",E85*(VLOOKUP(B85,Índices!$A:$H,8,0)-VLOOKUP(EDATE($C$8,-1),Índices!$A:$H,8,0))),\"\")","v":168301.80004766531},null,"1"]
[null,{"$f":"IFERROR(IF(EDATE($C$8,65)>$C$9,\"\",IF(EDATE($C$8,65)>DATE(2099,12,1),\"\",EDATE($C$8,65))),\"\")","v":"2024-04-01"},{"$f":"IFERROR(IF(B86=\"\",\"\",VLOOKUP(B86,Índices!$A:$H,5,0)),\"\")","v":8.3000000000000001E-3},{"$f":"IFERROR(IF(B86=\"\",\"\",VLOOKUP(B86,Índices!$A:$H,6,0)),\"\")","v":0},{"$f":"IFERROR(IF(B86=\"\",\"\",$C$10*VLOOKUP(B86,Índices!$A:$H,7,0)/VLOOKUP(EDATE($C$8,-1),Índices!$A:$H,7,0)),\"\")","v":271257.52076097223},{"$f":"IFERROR(IF(B86=\"\",\"\",E86*(VLOOKUP(B86,Índices!$A:$H,8,0)-VLOOKUP(EDATE($C$8,-1),Índices!$A:$H,8,0))),\"\")","v":169698.70498806096},null,{"$f":"IF(B86=\"\",\"vazia\",\"1\")","v":"1"}]
[null,{"$f":"IFERROR(IF(EDATE($C$8,66)>$C$9,\"\",IF(EDATE($C$8,66)>DATE(2099,12,1),\"\",EDATE($C$8,66))),\"\")","v":"2024-05-01"},{"$f":"IFERROR(IF(B87=\"\",\"\",VLOOKUP(B87,Índices!$A:$H,5,0)),\"\")","v":1.6000000000000001E-3},{"$f":"IFERROR(IF(B87=\"\",\"\",VLOOKUP(B87,Índices!$A:$H,6,0)),\"\")","v":7.3000000000000001E-3},{"$f":"IFERROR(IF(B87=\"\",\"\",$C$10*VLOOKUP(B87,Índices!$A:$H,7,0)/VLOOKUP(EDATE($C$8,-1),Índices!$A:$H,7,0)),\"\")","v":271691.53279418976},{"$f":"IFERROR(IF(B87=\"\",\"\",E87*(VLOOKUP(B87,Índices!$A:$H,8,0)-VLOOKUP(EDATE($C$8,-1),Índices!$A:$H,8,0))),\"\")","v":171953.57110543939},null,"1"]
[null,{"$f":"IFERROR(IF(EDATE($C$8,67)>$C$9,\"\",IF(EDATE($C$8,67)>DATE(2099,12,1),\"\",EDATE($C$8,67))),\"\")","v":"2024-06-01"},{"$f":"IFERROR(IF(B88=\"\",\"\",VLOOKUP(B88,Índices!$A:$H,5,0)),\"\")","v":3.8E-3},{"$f":"IFERROR(IF(B88=\"\",\"\",VLOOKUP(B88,Índices!$A:$H,6,0)),\"\")","v":4.5000000000000005E-3},{"$f":"IFERROR(IF(B88=\"\",\"\",$C$10*VLOOKUP(B88,Índices!$A:$H,7,0)/VLOOKUP(EDATE($C$8,-1),Índices!$A:$H,7,0)),\"\")","v":272723.96061880776},{"$f":"IFERROR(IF(B88=\"\",\"\",E88*(VLOOKUP(B88,Índices!$A:$H,8,0)-VLOOKUP(EDATE($C$8,-1),Índices!$A:$H,8,0))),\"\")","v":173834.25249842479},null,"1"]
[null,{"$f":"IFERROR(IF(EDATE($C$8,68)>$C$9,\"\",IF(EDATE($C$8,68)>DATE(2099,12,1),\"\",EDATE($C$8,68))),\"\")","v":"2024-07-01"},{"$f":"IFERROR(IF(B89=\"\",\"\",VLOOKUP(B89,Índices!$A:$H,5,0)),\"\")","v":4.5999999999999999E-3},{"$f":"IFERROR(IF(B89=\"\",\"\",VLOOKUP(B89,Índices!$A:$H,6,0)),\"\")","v":3.3000000000000008E-3},{"$f":"IFERROR(IF(B89=\"\",\"\",$C$10*VLOOKUP(B89,Índices!$A:$H,7,0)/VLOOKUP(EDATE($C$8,-1),Índices!$A:$H,7,0)),\"\")","v":273978.49083765422},{"$f":"IFERROR(IF(B89=\"\",\"\",E89*(VLOOKUP(B89,Índices!$A:$H,8,0)-VLOOKUP(EDATE($C$8,-1),Índices!$A:$H,8,0))),\"\")","v":175538.01907968172},null,"1"]
[null,{"$f":"IFERROR(IF(EDATE($C$8,69)>$C$9,\"\",IF(EDATE($C$8,69)>DATE(2099,12,1),\"\",EDATE($C$8,69))),\"\")","v":"2024-08-01"},{"$f":"IFERROR(IF(B90=\"\",\"\",VLOOKUP(B90,Índices!$A:$H,5,0)),\"\")","v":2.0999999999999999E-3},{"$f":"IFERROR(IF(B90=\"\",\"\",VLOOKUP(B90,Índices!$A:$H,6,0)),\"\")","v":7.000000000000001E-3},{"$f":"IFERROR(IF(B90=\"\",\"\",$C$10*VLOOKUP(B90,Índices!$A:$H,7,0)/VLOOKUP(EDATE($C$8,-1),Índices!$A:$H,7,0)),\"\")","v":274553.84566841327},{"$f":"IFERROR(IF(B90=\"\",\"\",E90*(VLOOKUP(B90,Índices!$A:$H,8,0)-VLOOKUP(EDATE($C$8,-1),Índices!$A:$H,8,0))),\"\")","v":177828.52583942798},null,"1"]
[null,{"$f":"IFERROR(IF(EDATE($C$8,70)>$C$9,\"\",IF(EDATE($C$8,70)>DATE(2099,12,1),\"\",EDATE($C$8,70))),\"\")","v":"2024-09-01"},{"$f":"IFERROR(IF(B91=\"\",\"\",VLOOKUP(B91,Índices!$A:$H,5,0)),\"\")","v":3.8E-3},{"$f":"IFERROR(IF(B91=\"\",\"\",VLOOKUP(B91,Índices!$A:$H,6,0)),\"\")","v":4.8999999999999998E-3},{"$f":"IFERROR(IF(B91=\"\",\"\",$C$10*VLOOKUP(B91,Índices!$A:$H,7,0)/VLOOKUP(EDATE($C$8,-1),Índices!$A:$H,7,0)),\"\")","v":275597.15028195322},{"$f":"IFERROR(IF(B91=\"\",\"\",E91*(VLOOKUP(B91,Índices!$A:$H,8,0)-VLOOKUP(EDATE($C$8,-1),Índices!$A:$H,8,0))),\"\")","v":179854.70027399939},null,"1"]
[null,{"$f":"IFERROR(IF(EDATE($C$8,71)>$C$9,\"\",IF(EDATE($C$8,71)>DATE(2099,12,1),\"\",EDATE($C$8,71))),\"\")","v":"2024-10-01"},{"$f":"IFERROR(IF(B92=\"\",\"\",VLOOKUP(B92,Índices!$A:$H,5,0)),\"\")","v":-2.0000000000000001E-4},{"$f":"IFERROR(IF(B92=\"\",\"\",VLOOKUP(B92,Índices!$A:$H,6,0)),\"\")","v":8.6E-3},{"$f":"IFERROR(IF(B92=\"\",\"\",$C$10*VLOOKUP(B92,Índices!$A:$H,7,0)/VLOOKUP(EDATE($C$8,-1),Índices!$A:$H,7,0)),\"\")","v":275542.03085189685},{"$f":"IFERROR(IF(B92=\"\",\"\",E92*(VLOOKUP(B92,Índices!$A:$H,8,0)-VLOOKUP(EDATE($C$8,-1),Índices!$A:$H,8,0))),\"\")","v":182188.39079927088},null,"1"]
[null,{"$f":"IFERROR(IF(EDATE($C$8,72)>$C$9,\"\",IF(EDATE($C$8,72)>DATE(2099,12,1),\"\",EDATE($C$8,72))),\"\")","v":"2024-11-01"},{"$f":"IFERROR(IF(B93=\"\",\"\",VLOOKUP(B93,Índices!$A:$H,5,0)),\"\")","v":4.4000000000000003E-3},{"$f":"IFERROR(IF(B93=\"\",\"\",VLOOKUP(B93,Índices!$A:$H,6,0)),\"\")","v":4.899999999999999E-3},{"$f":"IFERROR(IF(B93=\"\",\"\",$C$10*VLOOKUP(B93,Índices!$A:$H,7,0)/VLOOKUP(EDATE($C$8,-1),Índices!$A:$H,7,0)),\"\")","v":276754.41578764521},{"$f":"IFERROR(IF(B93=\"\",\"\",E93*(VLOOKUP(B93,Índices!$A:$H,8,0)-VLOOKUP(EDATE($C$8,-1),Índices!$A:$H,8,0))),\"\")","v":184346.11635614719},null,"1"]
[null,{"$f":"IFERROR(IF(EDATE($C$8,73)>$C$9,\"\",IF(EDATE($C$8,73)>DATE(2099,12,1),\"\",EDATE($C$8,73))),\"\")","v":"2024-12-01"},{"$f":"IFERROR(IF(B94=\"\",\"\",VLOOKUP(B94,Índices!$A:$H,5,0)),\"\")","v":5.5999999999999999E-3},{"$f":"IFERROR(IF(B94=\"\",\"\",VLOOKUP(B94,Índices!$A:$H,6,0)),\"\")","v":2.3000000000000008E-3},{"$f":"IFERROR(IF(B94=\"\",\"\",$C$10*VLOOKUP(B94,Índices!$A:$H,7,0)/VLOOKUP(EDATE($C$8,-1),Índices!$A:$H,7,0)),\"\")","v":278304.24051605602},{"$f":"IFERROR(IF(B94=\"\",\"\",E94*(VLOOKUP(B94,Índices!$A:$H,8,0)-VLOOKUP(EDATE($C$8,-1),Índices!$A:$H,8,0))),\"\")","v":186018.55436092854},null,"1"]
[null,{"$f":"IFERROR(IF(EDATE($C$8,74)>$C$9,\"\",IF(EDATE($C$8,74)>DATE(2099,12,1),\"\",EDATE($C$8,74))),\"\")","v":"2025-01-01"},{"$f":"IFERROR(IF(B95=\"\",\"\",VLOOKUP(B95,Índices!$A:$H,5,0)),\"\")","v":3.8999999999999998E-3},{"$f":"IFERROR(IF(B95=\"\",\"\",VLOOKUP(B95,Índices!$A:$H,6,0)),\"\")","v":5.3999999999999994E-3},{"$f":"IFERROR(IF(B95=\"\",\"\",$C$10*VLOOKUP(B95,Índices!$A:$H,7,0)/VLOOKUP(EDATE($C$8,-1),Índices!$A:$H,7,0)),\"\")","v":279389.62705406867},{"$f":"IFERROR(IF(B95=\"\",\"\",E95*(VLOOKUP(B95,Índices!$A:$H,8,0)-VLOOKUP(EDATE($C$8,-1),Índices!$A:$H,8,0))),\"\")","v":188252.73070902811},null,"1"]
[null,{"$f":"IFERROR(IF(EDATE($C$8,75)>$C$9,\"\",IF(EDATE($C$8,75)>DATE(2099,12,1),\"\",EDATE($C$8,75))),\"\")","v":"2025-02-01"},{"$f":"IFERROR(IF(B96=\"\",\"\",VLOOKUP(B96,Índices!$A:$H,5,0)),\"\")","v":5.1999999999999998E-3},{"$f":"IFERROR(IF(B96=\"\",\"\",VLOOKUP(B96,Índices!$A:$H,6,0)),\"\")","v":4.8999999999999998E-3},{"$f":"IFERROR(IF(B96=\"\",\"\",$C$10*VLOOKUP(B96,Índices!$A:$H,7,0)/VLOOKUP(EDATE($C$8,-1),Índices!$A:$H,7,0)),\"\")","v":280842.45311474986},{"$f":"IFERROR(IF(B96=\"\",\"\",E96*(VLOOKUP(B96,Índices!$A:$H,8,0)-VLOOKUP(EDATE($C$8,-1),Índices!$A:$H,8,0))),\"\")","v":190607.77292897739},null,"1"]
[null,{"$f":"IFERROR(IF(EDATE($C$8,76)>$C$9,\"\",IF(EDATE($C$8,76)>DATE(2099,12,1),\"\",EDATE($C$8,76))),\"\")","v":"2025-03-01"},{"$f":"IFERROR(IF(B97=\"\",\"\",VLOOKUP(B97,Índices!$A:$H,5,0)),\"\")","v":1.6000000000000001E-3},{"$f":"IFERROR(IF(B97=\"\",\"\",VLOOKUP(B97,Índices!$A:$H,6,0)),\"\")","v":8.3000000000000001E-3},{"$f":"IFERROR(IF(B97=\"\",\"\",$C$10*VLOOKUP(B97,Índices!$A:$H,7,0)/VLOOKUP(EDATE($C$8,-1),Índices!$A:$H,7,0)),\"\")","v":281291.80103973346},{"$f":"IFERROR(IF(B97=\"\",\"\",E97*(VLOOKUP(B97,Índices!$A:$H,8,0)-VLOOKUP(EDATE($C$8,-1),Índices!$A:$H,8,0))),\"\")","v":193247.46731429358},null,"1"]
[null,{"$f":"IFERROR(IF(EDATE($C$8,77)>$C$9,\"\",IF(EDATE($C$8,77)>DATE(2099,12,1),\"\",EDATE($C$8,77))),\"\")","v":"2025-04-01"},{"$f":"IFERROR(IF(B98=\"\",\"\",VLOOKUP(B98,Índices!$A:$H,5,0)),\"\")","v":9.5999999999999992E-3},{"$f":"IFERROR(IF(B98=\"\",\"\",VLOOKUP(B98,Índices!$A:$H,6,0)),\"\")","v":0},{"$f":"IFERROR(IF(B98=\"\",\"\",$C$10*VLOOKUP(B98,Índices!$A:$H,7,0)/VLOOKUP(EDATE($C$8,-1),Índices!$A:$H,7,0)),\"\")","v":283992.20232971496},{"$f":"IFERROR(IF(B98=\"\",\"\",E98*(VLOOKUP(B98,Índices!$A:$H,8,0)-VLOOKUP(EDATE($C$8,-1),Índices!$A:$H,8,0))),\"\")","v":195102.64300051084},null,"1"]
[null,{"$f":"IFERROR(IF(EDATE($C$8,78)>$C$9,\"\",IF(EDATE($C$8,78)>DATE(2099,12,1),\"\",EDATE($C$8,78))),\"\")","v":"2025-05-01"},{"$f":"IFERROR(IF(B99=\"\",\"\",VLOOKUP(B99,Índices!$A:$H,5,0)),\"\")","v":5.5999999999999999E-3},{"$f":"IFERROR(IF(B99=\"\",\"\",VLOOKUP(B99,Índices!$A:$H,6,0)),\"\")","v":5.0000000000000001E-3},{"$f":"IFERROR(IF(B99=\"\",\"\",$C$10*VLOOKUP(B99,Índices!$A:$H,7,0)/VLOOKUP(EDATE($C$8,-1),Índices!$A:$H,7,0)),\"\")","v":285582.55866276135},{"$f":"IFERROR(IF(B99=\"\",\"\",E99*(VLOOKUP(B99,Índices!$A:$H,8,0)-VLOOKUP(EDATE($C$8,-1),Índices!$A:$H,8,0))),\"\")","v":197623.13059462747},null,"1"]
[null,{"$f":"IFERROR(IF(EDATE($C$8,79)>$C$9,\"\",IF(EDATE($C$8,79)>DATE(2099,12,1),\"\",EDATE($C$8,79))),\"\")","v":"2025-06-01"},{"$f":"IFERROR(IF(B100=\"\",\"\",VLOOKUP(B100,Índices!$A:$H,5,0)),\"\")","v":4.3E-3},{"$f":"IFERROR(IF(B100=\"\",\"\",VLOOKUP(B100,Índices!$A:$H,6,0)),\"\")","v":7.1000000000000004E-3},{"$f":"IFERROR(IF(B100=\"\",\"\",$C$10*VLOOKUP(B100,Índices!$A:$H,7,0)/VLOOKUP(EDATE($C$8,-1),Índices!$A:$H,7,0)),\"\")","v":286810.5636650112},{"$f":"IFERROR(IF(B100=\"\",\"\",E100*(VLOOKUP(B100,Índices!$A:$H,8,0)-VLOOKUP(EDATE($C$8,-1),Índices!$A:$H,8,0))),\"\")","v":200509.2650582059},null,"1"]
[null,{"$f":"IFERROR(IF(EDATE($C$8,80)>$C$9,\"\",IF(EDATE($C$8,80)>DATE(2099,12,1),\"\",EDATE($C$8,80))),\"\")","v":"2025-07-01"},{"$f":"IFERROR(IF(B101=\"\",\"\",VLOOKUP(B101,Índices!$A:$H,5,0)),\"\")","v":2.5999999999999999E-3},{"$f":"IFERROR(IF(B101=\"\",\"\",VLOOKUP(B101,Índices!$A:$H,6,0)),\"\")","v":8.3999999999999995E-3},{"$f":"IFERROR(IF(B101=\"\",\"\",$C$10*VLOOKUP(B101,Índices!$A:$H,7,0)/VLOOKUP(EDATE($C$8,-1),Índices!$A:$H,7,0)),\"\")","v":287556.27113054023},{"$f":"IFERROR(IF(B101=\"\",\"\",E101*(VLOOKUP(B101,Índices!$A:$H,8,0)-VLOOKUP(EDATE($C$8,-1),Índices!$A:$H,8,0))),\"\")","v":203446.06182485376},null,"1"]
[null,{"$f":"IFERROR(IF(EDATE($C$8,81)>$C$9,\"\",IF(EDATE($C$8,81)>DATE(2099,12,1),\"\",EDATE($C$8,81))),\"\")","v":"2025-08-01"},{"$f":"IFERROR(IF(B102=\"\",\"\",VLOOKUP(B102,Índices!$A:$H,5,0)),\"\")","v":2.3999999999999998E-3},{"$f":"IFERROR(IF(B102=\"\",\"\",VLOOKUP(B102,Índices!$A:$H,6,0)),\"\")","v":1.0400000000000001E-2},{"$f":"IFERROR(IF(B102=\"\",\"\",$C$10*VLOOKUP(B102,Índices!$A:$H,7,0)/VLOOKUP(EDATE($C$8,-1),Índices!$A:$H,7,0)),\"\")","v":288246.40618125349},{"$f":"IFERROR(IF(B102=\"\",\"\",E102*(VLOOKUP(B102,Índices!$A:$H,8,0)-VLOOKUP(EDATE($C$8,-1),Índices!$A:$H,8,0))),\"\")","v":206932.09499751849},null,"1"]
[null,{"$f":"IFERROR(IF(EDATE($C$8,82)>$C$9,\"\",IF(EDATE($C$8,82)>DATE(2099,12,1),\"\",EDATE($C$8,82))),\"\")","v":"2025-09-01"},{"$f":"IFERROR(IF(B103=\"\",\"\",VLOOKUP(B103,Índices!$A:$H,5,0)),\"\")","v":2.5999999999999999E-3},{"$f":"IFERROR(IF(B103=\"\",\"\",VLOOKUP(B103,Índices!$A:$H,6,0)),\"\")","v":8.9999999999999993E-3},{"$f":"IFERROR(IF(B103=\"\",\"\",$C$10*VLOOKUP(B103,Índices!$A:$H,7,0)/VLOOKUP(EDATE($C$8,-1),Índices!$A:$H,7,0)),\"\")","v":288995.84683732479},{"$f":"IFERROR(IF(B103=\"\",\"\",E103*(VLOOKUP(B103,Índices!$A:$H,8,0)-VLOOKUP(EDATE($C$8,-1),Índices!$A:$H,8,0))),\"\")","v":210071.08106604795},null,"1"]
[null,{"$f":"IFERROR(IF(EDATE($C$8,83)>$C$9,\"\",IF(EDATE($C$8,83)>DATE(2099,12,1),\"\",EDATE($C$8,83))),\"\")","v":"2025-10-01"},{"$f":"IFERROR(IF(B104=\"\",\"\",VLOOKUP(B104,Índices!$A:$H,5,0)),\"\")","v":-1.1000000000000001E-3},{"$f":"IFERROR(IF(B104=\"\",\"\",VLOOKUP(B104,Índices!$A:$H,6,0)),\"\")","v":1.3300000000000001E-2},{"$f":"IFERROR(IF(B104=\"\",\"\",$C$10*VLOOKUP(B104,Índices!$A:$H,7,0)/VLOOKUP(EDATE($C$8,-1),Índices!$A:$H,7,0)),\"\")","v":288677.95140580373},{"$f":"IFERROR(IF(B104=\"\",\"\",E104*(VLOOKUP(B104,Índices!$A:$H,8,0)-VLOOKUP(EDATE($C$8,-1),Índices!$A:$H,8,0))),\"\")","v":213679.41963057252},null,"1"]
[null,{"$f":"IFERROR(IF(EDATE($C$8,84)>$C$9,\"\",IF(EDATE($C$8,84)>DATE(2099,12,1),\"\",EDATE($C$8,84))),\"\")","v":"2025-11-01"},{"$f":"IFERROR(IF(B105=\"\",\"\",VLOOKUP(B105,Índices!$A:$H,5,0)),\"\")","v":4.7999999999999996E-3},{"$f":"IFERROR(IF(B105=\"\",\"\",VLOOKUP(B105,Índices!$A:$H,6,0)),\"\")","v":8.0000000000000002E-3},{"$f":"IFERROR(IF(B105=\"\",\"\",$C$10*VLOOKUP(B105,Índices!$A:$H,7,0)/VLOOKUP(EDATE($C$8,-1),Índices!$A:$H,7,0)),\"\")","v":290063.60557255155},{"$f":"IFERROR(IF(B105=\"\",\"\",E105*(VLOOKUP(B105,Índices!$A:$H,8,0)-VLOOKUP(EDATE($C$8,-1),Índices!$A:$H,8,0))),\"\")","v":217025.58968937965},null,"1"]
[null,{"$f":"IFERROR(IF(EDATE($C$8,85)>$C$9,\"\",IF(EDATE($C$8,85)>DATE(2099,12,1),\"\",EDATE($C$8,85))),\"\")","v":"2025-12-01"},{"$f":"IFERROR(IF(B106=\"\",\"\",VLOOKUP(B106,Índices!$A:$H,5,0)),\"\")","v":8.9999999999999998E-4},{"$f":"IFERROR(IF(B106=\"\",\"\",VLOOKUP(B106,Índices!$A:$H,6,0)),\"\")","v":9.6000000000000009E-3},{"$f":"IFERROR(IF(B106=\"\",\"\",$C$10*VLOOKUP(B106,Índices!$A:$H,7,0)/VLOOKUP(EDATE($C$8,-1),Índices!$A:$H,7,0)),\"\")","v":290324.66281756683},{"$f":"IFERROR(IF(B106=\"\",\"\",E106*(VLOOKUP(B106,Índices!$A:$H,8,0)-VLOOKUP(EDATE($C$8,-1),Índices!$A:$H,8,0))),\"\")","v":220008.02948314868},null,"1"]
[null,{"$f":"IFERROR(IF(EDATE($C$8,86)>$C$9,\"\",IF(EDATE($C$8,86)>DATE(2099,12,1),\"\",EDATE($C$8,86))),\"\")","v":"2026-01-01"},{"$f":"IFERROR(IF(B107=\"\",\"\",VLOOKUP(B107,Índices!$A:$H,5,0)),\"\")","v":1.8E-3},{"$f":"IFERROR(IF(B107=\"\",\"\",VLOOKUP(B107,Índices!$A:$H,6,0)),\"\")","v":1.0400000000000001E-2},{"$f":"IFERROR(IF(B107=\"\",\"\",$C$10*VLOOKUP(B107,Índices!$A:$H,7,0)/VLOOKUP(EDATE($C$8,-1),Índices!$A:$H,7,0)),\"\")","v":290847.24721063842},{"$f":"IFERROR(IF(B107=\"\",\"\",E107*(VLOOKUP(B107,Índices!$A:$H,8,0)-VLOOKUP(EDATE($C$8,-1),Índices!$A:$H,8,0))),\"\")","v":223428.85530720901},null,"1"]
[null,{"$f":"IFERROR(IF(EDATE($C$8,87)>$C$9,\"\",IF(EDATE($C$8,87)>DATE(2099,12,1),\"\",EDATE($C$8,87))),\"\")","v":"2026-02-01"},{"$f":"IFERROR(IF(B108=\"\",\"\",VLOOKUP(B108,Índices!$A:$H,5,0)),\"\")","v":3.3E-3},{"$f":"IFERROR(IF(B108=\"\",\"\",VLOOKUP(B108,Índices!$A:$H,6,0)),\"\")","v":8.2999999999999984E-3},{"$f":"IFERROR(IF(B108=\"\",\"\",$C$10*VLOOKUP(B108,Índices!$A:$H,7,0)/VLOOKUP(EDATE($C$8,-1),Índices!$A:$H,7,0)),\"\")","v":291807.04312643356},{"$f":"IFERROR(IF(B108=\"\",\"\",E108*(VLOOKUP(B108,Índices!$A:$H,8,0)-VLOOKUP(EDATE($C$8,-1),Índices!$A:$H,8,0))),\"\")","v":226588.16898767228},null,"1"]
[null,{"$f":"IFERROR(IF(EDATE($C$8,88)>$C$9,\"\",IF(EDATE($C$8,88)>DATE(2099,12,1),\"\",EDATE($C$8,88))),\"\")","v":"2026-03-01"},{"$f":"IFERROR(IF(B109=\"\",\"\",VLOOKUP(B109,Índices!$A:$H,5,0)),\"\")","v":3.3E-3},{"$f":"IFERROR(IF(B109=\"\",\"\",VLOOKUP(B109,Índices!$A:$H,6,0)),\"\")","v":6.7000000000000002E-3},{"$f":"IFERROR(IF(B109=\"\",\"\",$C$10*VLOOKUP(B109,Índices!$A:$H,7,0)/VLOOKUP(EDATE($C$8,-1),Índices!$A:$H,7,0)),\"\")","v":292770.00636875082},{"$f":"IFERROR(IF(B109=\"\",\"\",E109*(VLOOKUP(B109,Índices!$A:$H,8,0)-VLOOKUP(EDATE($C$8,-1),Índices!$A:$H,8,0))),\"\")","v":229297.46898800222},null,"1"]
[null,{"$f":"IFERROR(IF(EDATE($C$8,89)>$C$9,\"\",IF(EDATE($C$8,89)>DATE(2099,12,1),\"\",EDATE($C$8,89))),\"\")","v":""},{"$f":"IFERROR(IF(B110=\"\",\"\",VLOOKUP(B110,Índices!$A:$H,5,0)),\"\")","v":""},{"$f":"IFERROR(IF(B110=\"\",\"\",VLOOKUP(B110,Índices!$A:$H,6,0)),\"\")","v":""},{"$f":"IFERROR(IF(B110=\"\",\"\",$C$10*VLOOKUP(B110,Índices!$A:$H,7,0)/VLOOKUP(EDATE($C$8,-1),Índices!$A:$H,7,0)),\"\")","v":""},{"$f":"IFERROR(IF(B110=\"\",\"\",E110*(VLOOKUP(B110,Índices!$A:$H,8,0)-VLOOKUP(EDATE($C$8,-1),Índices!$A:$H,8,0))),\"\")","v":""},null,"vazia"]
[null,{"$f":"IFERROR(IF(EDATE($C$8,90)>$C$9,\"\",IF(EDATE($C$8,90)>DATE(2099,12,1),\"\",EDATE($C$8,90))),\"\")","v":""},{"$f":"IFERROR(IF(B111=\"\",\"\",VLOOKUP(B111,Índices!$A:$H,5,0)),\"\")","v":""},{"$f":"IFERROR(IF(B111=\"\",\"\",VLOOKUP(B111,Índices!$A:$H,6,0)),\"\")","v":""},{"$f":"IFERROR(IF(B111=\"\",\"\",$C$10*VLOOKUP(B111,Índices!$A:$H,7,0)/VLOOKUP(EDATE($C$8,-1),Índices!$A:$H,7,0)),\"\")","v":""},{"$f":"IFERROR(IF(B111=\"\",\"\",E111*(VLOOKUP(B111,Índices!$A:$H,8,0)-VLOOKUP(EDATE($C$8,-1),Índices!$A:$H,8,0))),\"\")","v":""},null,"vazia"]
[null,{"$f":"IFERROR(IF(EDATE($C$8,91)>$C$9,\"\",IF(EDATE($C$8,91)>DATE(2099,12,1),\"\",EDATE($C$8,91))),\"\")","v":""},{"$f":"IFERROR(IF(B112=\"\",\"\",VLOOKUP(B112,Índices!$A:$H,5,0)),\"\")","v":""},{"$f":"IFERROR(IF(B112=\"\",\"\",VLOOKUP(B112,Índices!$A:$H,6,0)),\"\")","v":""},{"$f":"IFERROR(IF(B112=\"\",\"\",$C$10*VLOOKUP(B112,Índices!$A:$H,7,0)/VLOOKUP(EDATE($C$8,-1),Índices!$A:$H,7,0)),\"\")","v":""},{"$f":"IFERROR(IF(B112=\"\",\"\",E112*(VLOOKUP(B112,Índices!$A:$H,8,0)-VLOOKUP(EDATE($C$8,-1),Índices!$A:$H,8,0))),\"\")","v":""},null,"vazia"]
[null,{"$f":"IFERROR(IF(EDATE($C$8,92)>$C$9,\"\",IF(EDATE($C$8,92)>DATE(2099,12,1),\"\",EDATE($C$8,92))),\"\")","v":""},{"$f":"IFERROR(IF(B113=\"\",\"\",VLOOKUP(B113,Índices!$A:$H,5,0)),\"\")","v":""},{"$f":"IFERROR(IF(B113=\"\",\"\",VLOOKUP(B113,Índices!$A:$H,6,0)),\"\")","v":""},{"$f":"IFERROR(IF(B113=\"\",\"\",$C$10*VLOOKUP(B113,Índices!$A:$H,7,0)/VLOOKUP(EDATE($C$8,-1),Índices!$A:$H,7,0)),\"\")","v":""},{"$f":"IFERROR(IF(B113=\"\",\"\",E113*(VLOOKUP(B113,Índices!$A:$H,8,0)-VLOOKUP(EDATE($C$8,-1),Índices!$A:$H,8,0))),\"\")","v":""},null,"vazia"]
[null,{"$f":"IFERROR(IF(EDATE($C$8,93)>$C$9,\"\",IF(EDATE($C$8,93)>DATE(2099,12,1),\"\",EDATE($C$8,93))),\"\")","v":""},{"$f":"IFERROR(IF(B114=\"\",\"\",VLOOKUP(B114,Índices!$A:$H,5,0)),\"\")","v":""},{"$f":"IFERROR(IF(B114=\"\",\"\",VLOOKUP(B114,Índices!$A:$H,6,0)),\"\")","v":""},{"$f":"IFERROR(IF(B114=\"\",\"\",$C$10*VLOOKUP(B114,Índices!$A:$H,7,0)/VLOOKUP(EDATE($C$8,-1),Índices!$A:$H,7,0)),\"\")","v":""},{"$f":"IFERROR(IF(B114=\"\",\"\",E114*(VLOOKUP(B114,Índices!$A:$H,8,0)-VLOOKUP(EDATE($C$8,-1),Índices!$A:$H,8,0))),\"\")","v":""},null,"vazia"]
[null,{"$f":"IFERROR(IF(EDATE($C$8,94)>$C$9,\"\",IF(EDATE($C$8,94)>DATE(2099,12,1),\"\",EDATE($C$8,94))),\"\")","v":""},{"$f":"IFERROR(IF(B115=\"\",\"\",VLOOKUP(B115,Índices!$A:$H,5,0)),\"\")","v":""},{"$f":"IFERROR(IF(B115=\"\",\"\",VLOOKUP(B115,Índices!$A:$H,6,0)),\"\")","v":""},{"$f":"IFERROR(IF(B115=\"\",\"\",$C$10*VLOOKUP(B115,Índices!$A:$H,7,0)/VLOOKUP(EDATE($C$8,-1),Índices!$A:$H,7,0)),\"\")","v":""},{"$f":"IFERROR(IF(B115=\"\",\"\",E115*(VLOOKUP(B115,Índices!$A:$H,8,0)-VLOOKUP(EDATE($C$8,-1),Índices!$A:$H,8,0))),\"\")","v":""},null,"vazia"]
[null,{"$f":"IFERROR(IF(EDATE($C$8,95)>$C$9,\"\",IF(EDATE($C$8,95)>DATE(2099,12,1),\"\",EDATE($C$8,95))),\"\")","v":""},{"$f":"IFERROR(IF(B116=\"\",\"\",VLOOKUP(B116,Índices!$A:$H,5,0)),\"\")","v":""},{"$f":"IFERROR(IF(B116=\"\",\"\",VLOOKUP(B116,Índices!$A:$H,6,0)),\"\")","v":""},{"$f":"IFERROR(IF(B116=\"\",\"\",$C$10*VLOOKUP(B116,Índices!$A:$H,7,0)/VLOOKUP(EDATE($C$8,-1),Índices!$A:$H,7,0)),\"\")","v":""},{"$f":"IFERROR(IF(B116=\"\",\"\",E116*(VLOOKUP(B116,Índices!$A:$H,8,0)-VLOOKUP(EDATE($C$8,-1),Índices!$A:$H,8,0))),\"\")","v":""},null,"vazia"]
[null,{"$f":"IFERROR(IF(EDATE($C$8,96)>$C$9,\"\",IF(EDATE($C$8,96)>DATE(2099,12,1),\"\",EDATE($C$8,96))),\"\")","v":""},{"$f":"IFERROR(IF(B117=\"\",\"\",VLOOKUP(B117,Índices!$A:$H,5,0)),\"\")","v":""},{"$f":"IFERROR(IF(B117=\"\",\"\",VLOOKUP(B117,Índices!$A:$H,6,0)),\"\")","v":""},{"$f":"IFERROR(IF(B117=\"\",\"\",$C$10*VLOOKUP(B117,Índices!$A:$H,7,0)/VLOOKUP(EDATE($C$8,-1),Índices!$A:$H,7,0)),\"\")","v":""},{"$f":"IFERROR(IF(B117=\"\",\"\",E117*(VLOOKUP(B117,Índices!$A:$H,8,0)-VLOOKUP(EDATE($C$8,-1),Índices!$A:$H,8,0))),\"\")","v":""},null,"vazia"]
[null,{"$f":"IFERROR(IF(EDATE($C$8,97)>$C$9,\"\",IF(EDATE($C$8,97)>DATE(2099,12,1),\"\",EDATE($C$8,97))),\"\")","v":""},{"$f":"IFERROR(IF(B118=\"\",\"\",VLOOKUP(B118,Índices!$A:$H,5,0)),\"\")","v":""},{"$f":"IFERROR(IF(B118=\"\",\"\",VLOOKUP(B118,Índices!$A:$H,6,0)),\"\")","v":""},{"$f":"IFERROR(IF(B118=\"\",\"\",$C$10*VLOOKUP(B118,Índices!$A:$H,7,0)/VLOOKUP(EDATE($C$8,-1),Índices!$A:$H,7,0)),\"\")","v":""},{"$f":"IFERROR(IF(B118=\"\",\"\",E118*(VLOOKUP(B118,Índices!$A:$H,8,0)-VLOOKUP(EDATE($C$8,-1),Índices!$A:$H,8,0))),\"\")","v":""},null,"vazia"]
[null,{"$f":"IFERROR(IF(EDATE($C$8,98)>$C$9,\"\",IF(EDATE($C$8,98)>DATE(2099,12,1),\"\",EDATE($C$8,98))),\"\")","v":""},{"$f":"IFERROR(IF(B119=\"\",\"\",VLOOKUP(B119,Índices!$A:$H,5,0)),\"\")","v":""},{"$f":"IFERROR(IF(B119=\"\",\"\",VLOOKUP(B119,Índices!$A:$H,6,0)),\"\")","v":""},{"$f":"IFERROR(IF(B119=\"\",\"\",$C$10*VLOOKUP(B119,Índices!$A:$H,7,0)/VLOOKUP(EDATE($C$8,-1),Índices!$A:$H,7,0)),\"\")","v":""},{"$f":"IFERROR(IF(B119=\"\",\"\",E119*(VLOOKUP(B119,Índices!$A:$H,8,0)-VLOOKUP(EDATE($C$8,-1),Índices!$A:$H,8,0))),\"\")","v":""},null,"vazia"]
[null,{"$f":"IFERROR(IF(EDATE($C$8,99)>$C$9,\"\",IF(EDATE($C$8,99)>DATE(2099,12,1),\"\",EDATE($C$8,99))),\"\")","v":""},{"$f":"IFERROR(IF(B120=\"\",\"\",VLOOKUP(B120,Índices!$A:$H,5,0)),\"\")","v":""},{"$f":"IFERROR(IF(B120=\"\",\"\",VLOOKUP(B120,Índices!$A:$H,6,0)),\"\")","v":""},{"$f":"IFERROR(IF(B120=\"\",\"\",$C$10*VLOOKUP(B120,Índices!$A:$H,7,0)/VLOOKUP(EDATE($C$8,-1),Índices!$A:$H,7,0)),\"\")","v":""},{"$f":"IFERROR(IF(B120=\"\",\"\",E120*(VLOOKUP(B120,Índices!$A:$H,8,0)-VLOOKUP(EDATE($C$8,-1),Índices!$A:$H,8,0))),\"\")","v":""},null,"vazia"]
[null,{"$f":"IFERROR(IF(EDATE($C$8,100)>$C$9,\"\",IF(EDATE($C$8,100)>DATE(2099,12,1),\"\",EDATE($C$8,100))),\"\")","v":""},{"$f":"IFERROR(IF(B121=\"\",\"\",VLOOKUP(B121,Índices!$A:$H,5,0)),\"\")","v":""},{"$f":"IFERROR(IF(B121=\"\",\"\",VLOOKUP(B121,Índices!$A:$H,6,0)),\"\")","v":""},{"$f":"IFERROR(IF(B121=\"\",\"\",$C$10*VLOOKUP(B121,Índices!$A:$H,7,0)/VLOOKUP(EDATE($C$8,-1),Índices!$A:$H,7,0)),\"\")","v":""},{"$f":"IFERROR(IF(B121=\"\",\"\",E121*(VLOOKUP(B121,Índices!$A:$H,8,0)-VLOOKUP(EDATE($C$8,-1),Índices!$A:$H,8,0))),\"\")","v":""},null,"vazia"]
[null,{"$f":"IFERROR(IF(EDATE($C$8,101)>$C$9,\"\",IF(EDATE($C$8,101)>DATE(2099,12,1),\"\",EDATE($C$8,101))),\"\")","v":""},{"$f":"IFERROR(IF(B122=\"\",\"\",VLOOKUP(B122,Índices!$A:$H,5,0)),\"\")","v":""},{"$f":"IFERROR(IF(B122=\"\",\"\",VLOOKUP(B122,Índices!$A:$H,6,0)),\"\")","v":""},{"$f":"IFERROR(IF(B122=\"\",\"\",$C$10*VLOOKUP(B122,Índices!$A:$H,7,0)/VLOOKUP(EDATE($C$8,-1),Índices!$A:$H,7,0)),\"\")","v":""},{"$f":"IFERROR(IF(B122=\"\",\"\",E122*(VLOOKUP(B122,Índices!$A:$H,8,0)-VLOOKUP(EDATE($C$8,-1),Índices!$A:$H,8,0))),\"\")","v":""},null,"vazia"]
[null,{"$f":"IFERROR(IF(EDATE($C$8,102)>$C$9,\"\",IF(EDATE($C$8,102)>DATE(2099,12,1),\"\",EDATE($C$8,102))),\"\")","v":""},{"$f":"IFERROR(IF(B123=\"\",\"\",VLOOKUP(B123,Índices!$A:$H,5,0)),\"\")","v":""},{"$f":"IFERROR(IF(B123=\"\",\"\",VLOOKUP(B123,Índices!$A:$H,6,0)),\"\")","v":""},{"$f":"IFERROR(IF(B123=\"\",\"\",$C$10*VLOOKUP(B123,Índices!$A:$H,7,0)/VLOOKUP(EDATE($C$8,-1),Índices!$A:$H,7,0)),\"\")","v":""},{"$f":"IFERROR(IF(B123=\"\",\"\",E123*(VLOOKUP(B123,Índices!$A:$H,8,0)-VLOOKUP(EDATE($C$8,-1),Índices!$A:$H,8,0))),\"\")","v":""},null,"vazia"]
[null,{"$f":"IFERROR(IF(EDATE($C$8,103)>$C$9,\"\",IF(EDATE($C$8,103)>DATE(2099,12,1),\"\",EDATE($C$8,103))),\"\")","v":""},{"$f":"IFERROR(IF(B124=\"\",\"\",VLOOKUP(B124,Índices!$A:$H,5,0)),\"\")","v":""},{"$f":"IFERROR(IF(B124=\"\",\"\",VLOOKUP(B124,Índices!$A:$H,6,0)),\"\")","v":""},{"$f":"IFERROR(IF(B124=\"\",\"\",$C$10*VLOOKUP(B124,Índices!$A:$H,7,0)/VLOOKUP(EDATE($C$8,-1),Índices!$A:$H,7,0)),\"\")","v":""},{"$f":"IFERROR(IF(B124=\"\",\"\",E124*(VLOOKUP(B124,Índices!$A:$H,8,0)-VLOOKUP(EDATE($C$8,-1),Índices!$A:$H,8,0))),\"\")","v":""},null,"vazia"]
[null,{"$f":"IFERROR(IF(EDATE($C$8,104)>$C$9,\"\",IF(EDATE($C$8,104)>DATE(2099,12,1),\"\",EDATE($C$8,104))),\"\")","v":""},{"$f":"IFERROR(IF(B125=\"\",\"\",VLOOKUP(B125,Índices!$A:$H,5,0)),\"\")","v":""},{"$f":"IFERROR(IF(B125=\"\",\"\",VLOOKUP(B125,Índices!$A:$H,6,0)),\"\")","v":""},{"$f":"IFERROR(IF(B125=\"\",\"\",$C$10*VLOOKUP(B125,Índices!$A:$H,7,0)/VLOOKUP(EDATE($C$8,-1),Índices!$A:$H,7,0)),\"\")","v":""},{"$f":"IFERROR(IF(B125=\"\",\"\",E125*(VLOOKUP(B125,Índices!$A:$H,8,0)-VLOOKUP(EDATE($C$8,-1),Índices!$A:$H,8,0))),\"\")","v":""},null,"vazia"]
[null,{"$f":"IFERROR(IF(EDATE($C$8,105)>$C$9,\"\",IF(EDATE($C$8,105)>DATE(2099,12,1),\"\",EDATE($C$8,105))),\"\")","v":""},{"$f":"IFERROR(IF(B126=\"\",\"\",VLOOKUP(B126,Índices!$A:$H,5,0)),\"\")","v":""},{"$f":"IFERROR(IF(B126=\"\",\"\",VLOOKUP(B126,Índices!$A:$H,6,0)),\"\")","v":""},{"$f":"IFERROR(IF(B126=\"\",\"\",$C$10*VLOOKUP(B126,Índices!$A:$H,7,0)/VLOOKUP(EDATE($C$8,-1),Índices!$A:$H,7,0)),\"\")","v":""},{"$f":"IFERROR(IF(B126=\"\",\"\",E126*(VLOOKUP(B126,Índices!$A:$H,8,0)-VLOOKUP(EDATE($C$8,-1),Índices!$A:$H,8,0))),\"\")","v":""},null,"vazia"]
[null,{"$f":"IFERROR(IF(EDATE($C$8,106)>$C$9,\"\",IF(EDATE($C$8,106)>DATE(2099,12,1),\"\",EDATE($C$8,106))),\"\")","v":""},{"$f":"IFERROR(IF(B127=\"\",\"\",VLOOKUP(B127,Índices!$A:$H,5,0)),\"\")","v":""},{"$f":"IFERROR(IF(B127=\"\",\"\",VLOOKUP(B127,Índices!$A:$H,6,0)),\"\")","v":""},{"$f":"IFERROR(IF(B127=\"\",\"\",$C$10*VLOOKUP(B127,Índices!$A:$H,7,0)/VLOOKUP(EDATE($C$8,-1),Índices!$A:$H,7,0)),\"\")","v":""},{"$f":"IFERROR(IF(B127=\"\",\"\",E127*(VLOOKUP(B127,Índices!$A:$H,8,0)-VLOOKUP(EDATE($C$8,-1),Índices!$A:$H,8,0))),\"\")","v":""},null,"vazia"]
[null,{"$f":"IFERROR(IF(EDATE($C$8,107)>$C$9,\"\",IF(EDATE($C$8,107)>DATE(2099,12,1),\"\",EDATE($C$8,107))),\"\")","v":""},{"$f":"IFERROR(IF(B128=\"\",\"\",VLOOKUP(B128,Índices!$A:$H,5,0)),\"\")","v":""},{"$f":"IFERROR(IF(B128=\"\",\"\",VLOOKUP(B128,Índices!$A:$H,6,0)),\"\")","v":""},{"$f":"IFERROR(IF(B128=\"\",\"\",$C$10*VLOOKUP(B128,Índices!$A:$H,7,0)/VLOOKUP(EDATE($C$8,-1),Índices!$A:$H,7,0)),\"\")","v":""},{"$f":"IFERROR(IF(B128=\"\",\"\",E128*(VLOOKUP(B128,Índices!$A:$H,8,0)-VLOOKUP(EDATE($C$8,-1),Índices!$A:$H,8,0))),\"\")","v":""},null,"vazia"]
[null,{"$f":"IFERROR(IF(EDATE($C$8,108)>$C$9,\"\",IF(EDATE($C$8,108)>DATE(2099,12,1),\"\",EDATE($C$8,108))),\"\")","v":""},{"$f":"IFERROR(IF(B129=\"\",\"\",VLOOKUP(B129,Índices!$A:$H,5,0)),\"\")","v":""},{"$f":"IFERROR(IF(B129=\"\",\"\",VLOOKUP(B129,Índices!$A:$H,6,0)),\"\")","v":""},{"$f":"IFERROR(IF(B129=\"\",\"\",$C$10*VLOOKUP(B129,Índices!$A:$H,7,0)/VLOOKUP(EDATE($C$8,-1),Índices!$A:$H,7,0)),\"\")","v":""},{"$f":"IFERROR(IF(B129=\"\",\"\",E129*(VLOOKUP(B129,Índices!$A:$H,8,0)-VLOOKUP(EDATE($C$8,-1),Índices!$A:$H,8,0))),\"\")","v":""},null,"vazia"]
[null,{"$f":"IFERROR(IF(EDATE($C$8,109)>$C$9,\"\",IF(EDATE($C$8,109)>DATE(2099,12,1),\"\",EDATE($C$8,109))),\"\")","v":""},{"$f":"IFERROR(IF(B130=\"\",\"\",VLOOKUP(B130,Índices!$A:$H,5,0)),\"\")","v":""},{"$f":"IFERROR(IF(B130=\"\",\"\",VLOOKUP(B130,Índices!$A:$H,6,0)),\"\")","v":""},{"$f":"IFERROR(IF(B130=\"\",\"\",$C$10*VLOOKUP(B130,Índices!$A:$H,7,0)/VLOOKUP(EDATE($C$8,-1),Índices!$A:$H,7,0)),\"\")","v":""},{"$f":"IFERROR(IF(B130=\"\",\"\",E130*(VLOOKUP(B130,Índices!$A:$H,8,0)-VLOOKUP(EDATE($C$8,-1),Índices!$A:$H,8,0))),\"\")","v":""},null,"vazia"]
[null,{"$f":"IFERROR(IF(EDATE($C$8,110)>$C$9,\"\",IF(EDATE($C$8,110)>DATE(2099,12,1),\"\",EDATE($C$8,110))),\"\")","v":""},{"$f":"IFERROR(IF(B131=\"\",\"\",VLOOKUP(B131,Índices!$A:$H,5,0)),\"\")","v":""},{"$f":"IFERROR(IF(B131=\"\",\"\",VLOOKUP(B131,Índices!$A:$H,6,0)),\"\")","v":""},{"$f":"IFERROR(IF(B131=\"\",\"\",$C$10*VLOOKUP(B131,Índices!$A:$H,7,0)/VLOOKUP(EDATE($C$8,-1),Índices!$A:$H,7,0)),\"\")","v":""},{"$f":"IFERROR(IF(B131=\"\",\"\",E131*(VLOOKUP(B131,Índices!$A:$H,8,0)-VLOOKUP(EDATE($C$8,-1),Índices!$A:$H,8,0))),\"\")","v":""},null,"vazia"]
[null,{"$f":"IFERROR(IF(EDATE($C$8,111)>$C$9,\"\",IF(EDATE($C$8,111)>DATE(2099,12,1),\"\",EDATE($C$8,111))),\"\")","v":""},{"$f":"IFERROR(IF(B132=\"\",\"\",VLOOKUP(B132,Índices!$A:$H,5,0)),\"\")","v":""},{"$f":"IFERROR(IF(B132=\"\",\"\",VLOOKUP(B132,Índices!$A:$H,6,0)),\"\")","v":""},{"$f":"IFERROR(IF(B132=\"\",\"\",$C$10*VLOOKUP(B132,Índices!$A:$H,7,0)/VLOOKUP(EDATE($C$8,-1),Índices!$A:$H,7,0)),\"\")","v":""},{"$f":"IFERROR(IF(B132=\"\",\"\",E132*(VLOOKUP(B132,Índices!$A:$H,8,0)-VLOOKUP(EDATE($C$8,-1),Índices!$A:$H,8,0))),\"\")","v":""},null,"vazia"]
[null,{"$f":"IFERROR(IF(EDATE($C$8,112)>$C$9,\"\",IF(EDATE($C$8,112)>DATE(2099,12,1),\"\",EDATE($C$8,112))),\"\")","v":""},{"$f":"IFERROR(IF(B133=\"\",\"\",VLOOKUP(B133,Índices!$A:$H,5,0)),\"\")","v":""},{"$f":"IFERROR(IF(B133=\"\",\"\",VLOOKUP(B133,Índices!$A:$H,6,0)),\"\")","v":""},{"$f":"IFERROR(IF(B133=\"\",\"\",$C$10*VLOOKUP(B133,Índices!$A:$H,7,0)/VLOOKUP(EDATE($C$8,-1),Índices!$A:$H,7,0)),\"\")","v":""},{"$f":"IFERROR(IF(B133=\"\",\"\",E133*(VLOOKUP(B133,Índices!$A:$H,8,0)-VLOOKUP(EDATE($C$8,-1),Índices!$A:$H,8,0))),\"\")","v":""},null,"vazia"]
[null,{"$f":"IFERROR(IF(EDATE($C$8,113)>$C$9,\"\",IF(EDATE($C$8,113)>DATE(2099,12,1),\"\",EDATE($C$8,113))),\"\")","v":""},{"$f":"IFERROR(IF(B134=\"\",\"\",VLOOKUP(B134,Índices!$A:$H,5,0)),\"\")","v":""},{"$f":"IFERROR(IF(B134=\"\",\"\",VLOOKUP(B134,Índices!$A:$H,6,0)),\"\")","v":""},{"$f":"IFERROR(IF(B134=\"\",\"\",$C$10*VLOOKUP(B134,Índices!$A:$H,7,0)/VLOOKUP(EDATE($C$8,-1),Índices!$A:$H,7,0)),\"\")","v":""},{"$f":"IFERROR(IF(B134=\"\",\"\",E134*(VLOOKUP(B134,Índices!$A:$H,8,0)-VLOOKUP(EDATE($C$8,-1),Índices!$A:$H,8,0))),\"\")","v":""},null,"vazia"]
[null,{"$f":"IFERROR(IF(EDATE($C$8,114)>$C$9,\"\",IF(EDATE($C$8,114)>DATE(2099,12,1),\"\",EDATE($C$8,114))),\"\")","v":""},{"$f":"IFERROR(IF(B135=\"\",\"\",VLOOKUP(B135,Índices!$A:$H,5,0)),\"\")","v":""},{"$f":"IFERROR(IF(B135=\"\",\"\",VLOOKUP(B135,Índices!$A:$H,6,0)),\"\")","v":""},{"$f":"IFERROR(IF(B135=\"\",\"\",$C$10*VLOOKUP(B135,Índices!$A:$H,7,0)/VLOOKUP(EDATE($C$8,-1),Índices!$A:$H,7,0)),\"\")","v":""},{"$f":"IFERROR(IF(B135=\"\",\"\",E135*(VLOOKUP(B135,Índices!$A:$H,8,0)-VLOOKUP(EDATE($C$8,-1),Índices!$A:$H,8,0))),\"\")","v":""},null,"vazia"]
[null,{"$f":"IFERROR(IF(EDATE($C$8,115)>$C$9,\"\",IF(EDATE($C$8,115)>DATE(2099,12,1),\"\",EDATE($C$8,115))),\"\")","v":""},{"$f":"IFERROR(IF(B136=\"\",\"\",VLOOKUP(B136,Índices!$A:$H,5,0)),\"\")","v":""},{"$f":"IFERROR(IF(B136=\"\",\"\",VLOOKUP(B136,Índices!$A:$H,6,0)),\"\")","v":""},{"$f":"IFERROR(IF(B136=\"\",\"\",$C$10*VLOOKUP(B136,Índices!$A:$H,7,0)/VLOOKUP(EDATE($C$8,-1),Índices!$A:$H,7,0)),\"\")","v":""},{"$f":"IFERROR(IF(B136=\"\",\"\",E136*(VLOOKUP(B136,Índices!$A:$H,8,0)-VLOOKUP(EDATE($C$8,-1),Índices!$A:$H,8,0))),\"\")","v":""},null,"vazia"]
[null,{"$f":"IFERROR(IF(EDATE($C$8,116)>$C$9,\"\",IF(EDATE($C$8,116)>DATE(2099,12,1),\"\",EDATE($C$8,116))),\"\")","v":""},{"$f":"IFERROR(IF(B137=\"\",\"\",VLOOKUP(B137,Índices!$A:$H,5,0)),\"\")","v":""},{"$f":"IFERROR(IF(B137=\"\",\"\",VLOOKUP(B137,Índices!$A:$H,6,0)),\"\")","v":""},{"$f":"IFERROR(IF(B137=\"\",\"\",$C$10*VLOOKUP(B137,Índices!$A:$H,7,0)/VLOOKUP(EDATE($C$8,-1),Índices!$A:$H,7,0)),\"\")","v":""},{"$f":"IFERROR(IF(B137=\"\",\"\",E137*(VLOOKUP(B137,Índices!$A:$H,8,0)-VLOOKUP(EDATE($C$8,-1),Índices!$A:$H,8,0))),\"\")","v":""},null,"vazia"]
[null,{"$f":"IFERROR(IF(EDATE($C$8,117)>$C$9,\"\",IF(EDATE($C$8,117)>DATE(2099,12,1),\"\",EDATE($C$8,117))),\"\")","v":""},{"$f":"IFERROR(IF(B138=\"\",\"\",VLOOKUP(B138,Índices!$A:$H,5,0)),\"\")","v":""},{"$f":"IFERROR(IF(B138=\"\",\"\",VLOOKUP(B138,Índices!$A:$H,6,0)),\"\")","v":""},{"$f":"IFERROR(IF(B138=\"\",\"\",$C$10*VLOOKUP(B138,Índices!$A:$H,7,0)/VLOOKUP(EDATE($C$8,-1),Índices!$A:$H,7,0)),\"\")","v":""},{"$f":"IFERROR(IF(B138=\"\",\"\",E138*(VLOOKUP(B138,Índices!$A:$H,8,0)-VLOOKUP(EDATE($C$8,-1),Índices!$A:$H,8,0))),\"\")","v":""},null,"vazia"]
[null,{"$f":"IFERROR(IF(EDATE($C$8,118)>$C$9,\"\",IF(EDATE($C$8,118)>DATE(2099,12,1),\"\",EDATE($C$8,118))),\"\")","v":""},{"$f":"IFERROR(IF(B139=\"\",\"\",VLOOKUP(B139,Índices!$A:$H,5,0)),\"\")","v":""},{"$f":"IFERROR(IF(B139=\"\",\"\",VLOOKUP(B139,Índices!$A:$H,6,0)),\"\")","v":""},{"$f":"IFERROR(IF(B139=\"\",\"\",$C$10*VLOOKUP(B139,Índices!$A:$H,7,0)/VLOOKUP(EDATE($C$8,-1),Índices!$A:$H,7,0)),\"\")","v":""},{"$f":"IFERROR(IF(B139=\"\",\"\",E139*(VLOOKUP(B139,Índices!$A:$H,8,0)-VLOOKUP(EDATE($C$8,-1),Índices!$A:$H,8,0))),\"\")","v":""},null,"vazia"]
[null,{"$f":"IFERROR(IF(EDATE($C$8,119)>$C$9,\"\",IF(EDATE($C$8,119)>DATE(2099,12,1),\"\",EDATE($C$8,119))),\"\")","v":""},{"$f":"IFERROR(IF(B140=\"\",\"\",VLOOKUP(B140,Índices!$A:$H,5,0)),\"\")","v":""},{"$f":"IFERROR(IF(B140=\"\",\"\",VLOOKUP(B140,Índices!$A:$H,6,0)),\"\")","v":""},{"$f":"IFERROR(IF(B140=\"\",\"\",$C$10*VLOOKUP(B140,Índices!$A:$H,7,0)/VLOOKUP(EDATE($C$8,-1),Índices!$A:$H,7,0)),\"\")","v":""},{"$f":"IFERROR(IF(B140=\"\",\"\",E140*(VLOOKUP(B140,Índices!$A:$H,8,0)-VLOOKUP(EDATE($C$8,-1),Índices!$A:$H,8,0))),\"\")","v":""},null,"vazia"]
[null,{"$f":"IFERROR(IF(EDATE($C$8,120)>$C$9,\"\",IF(EDATE($C$8,120)>DATE(2099,12,1),\"\",EDATE($C$8,120))),\"\")","v":""},{"$f":"IFERROR(IF(B141=\"\",\"\",VLOOKUP(B141,Índices!$A:$H,5,0)),\"\")","v":""},{"$f":"IFERROR(IF(B141=\"\",\"\",VLOOKUP(B141,Índices!$A:$H,6,0)),\"\")","v":""},{"$f":"IFERROR(IF(B141=\"\",\"\",$C$10*VLOOKUP(B141,Índices!$A:$H,7,0)/VLOOKUP(EDATE($C$8,-1),Índices!$A:$H,7,0)),\"\")","v":""},{"$f":"IFERROR(IF(B141=\"\",\"\",E141*(VLOOKUP(B141,Índices!$A:$H,8,0)-VLOOKUP(EDATE($C$8,-1),Índices!$A:$H,8,0))),\"\")","v":""},null,"vazia"]
[null,{"$f":"IFERROR(IF(EDATE($C$8,121)>$C$9,\"\",IF(EDATE($C$8,121)>DATE(2099,12,1),\"\",EDATE($C$8,121))),\"\")","v":""},{"$f":"IFERROR(IF(B142=\"\",\"\",VLOOKUP(B142,Índices!$A:$H,5,0)),\"\")","v":""},{"$f":"IFERROR(IF(B142=\"\",\"\",VLOOKUP(B142,Índices!$A:$H,6,0)),\"\")","v":""},{"$f":"IFERROR(IF(B142=\"\",\"\",$C$10*VLOOKUP(B142,Índices!$A:$H,7,0)/VLOOKUP(EDATE($C$8,-1),Índices!$A:$H,7,0)),\"\")","v":""},{"$f":"IFERROR(IF(B142=\"\",\"\",E142*(VLOOKUP(B142,Índices!$A:$H,8,0)-VLOOKUP(EDATE($C$8,-1),Índices!$A:$H,8,0))),\"\")","v":""},null,"vazia"]
[null,{"$f":"IFERROR(IF(EDATE($C$8,122)>$C$9,\"\",IF(EDATE($C$8,122)>DATE(2099,12,1),\"\",EDATE($C$8,122))),\"\")","v":""},{"$f":"IFERROR(IF(B143=\"\",\"\",VLOOKUP(B143,Índices!$A:$H,5,0)),\"\")","v":""},{"$f":"IFERROR(IF(B143=\"\",\"\",VLOOKUP(B143,Índices!$A:$H,6,0)),\"\")","v":""},{"$f":"IFERROR(IF(B143=\"\",\"\",$C$10*VLOOKUP(B143,Índices!$A:$H,7,0)/VLOOKUP(EDATE($C$8,-1),Índices!$A:$H,7,0)),\"\")","v":""},{"$f":"IFERROR(IF(B143=\"\",\"\",E143*(VLOOKUP(B143,Índices!$A:$H,8,0)-VLOOKUP(EDATE($C$8,-1),Índices!$A:$H,8,0))),\"\")","v":""},null,"vazia"]
[null,{"$f":"IFERROR(IF(EDATE($C$8,123)>$C$9,\"\",IF(EDATE($C$8,123)>DATE(2099,12,1),\"\",EDATE($C$8,123))),\"\")","v":""},{"$f":"IFERROR(IF(B144=\"\",\"\",VLOOKUP(B144,Índices!$A:$H,5,0)),\"\")","v":""},{"$f":"IFERROR(IF(B144=\"\",\"\",VLOOKUP(B144,Índices!$A:$H,6,0)),\"\")","v":""},{"$f":"IFERROR(IF(B144=\"\",\"\",$C$10*VLOOKUP(B144,Índices!$A:$H,7,0)/VLOOKUP(EDATE($C$8,-1),Índices!$A:$H,7,0)),\"\")","v":""},{"$f":"IFERROR(IF(B144=\"\",\"\",E144*(VLOOKUP(B144,Índices!$A:$H,8,0)-VLOOKUP(EDATE($C$8,-1),Índices!$A:$H,8,0))),\"\")","v":""},null,"vazia"]
[null,{"$f":"IFERROR(IF(EDATE($C$8,124)>$C$9,\"\",IF(EDATE($C$8,124)>DATE(2099,12,1),\"\",EDATE($C$8,124))),\"\")","v":""},{"$f":"IFERROR(IF(B145=\"\",\"\",VLOOKUP(B145,Índices!$A:$H,5,0)),\"\")","v":""},{"$f":"IFERROR(IF(B145=\"\",\"\",VLOOKUP(B145,Índices!$A:$H,6,0)),\"\")","v":""},{"$f":"IFERROR(IF(B145=\"\",\"\",$C$10*VLOOKUP(B145,Índices!$A:$H,7,0)/VLOOKUP(EDATE($C$8,-1),Índices!$A:$H,7,0)),\"\")","v":""},{"$f":"IFERROR(IF(B145=\"\",\"\",E145*(VLOOKUP(B145,Índices!$A:$H,8,0)-VLOOKUP(EDATE($C$8,-1),Índices!$A:$H,8,0))),\"\")","v":""},null,"vazia"]
[null,{"$f":"IFERROR(IF(EDATE($C$8,125)>$C$9,\"\",IF(EDATE($C$8,125)>DATE(2099,12,1),\"\",EDATE($C$8,125))),\"\")","v":""},{"$f":"IFERROR(IF(B146=\"\",\"\",VLOOKUP(B146,Índices!$A:$H,5,0)),\"\")","v":""},{"$f":"IFERROR(IF(B146=\"\",\"\",VLOOKUP(B146,Índices!$A:$H,6,0)),\"\")","v":""},{"$f":"IFERROR(IF(B146=\"\",\"\",$C$10*VLOOKUP(B146,Índices!$A:$H,7,0)/VLOOKUP(EDATE($C$8,-1),Índices!$A:$H,7,0)),\"\")","v":""},{"$f":"IFERROR(IF(B146=\"\",\"\",E146*(VLOOKUP(B146,Índices!$A:$H,8,0)-VLOOKUP(EDATE($C$8,-1),Índices!$A:$H,8,0))),\"\")","v":""},null,"vazia"]
[null,{"$f":"IFERROR(IF(EDATE($C$8,126)>$C$9,\"\",IF(EDATE($C$8,126)>DATE(2099,12,1),\"\",EDATE($C$8,126))),\"\")","v":""},{"$f":"IFERROR(IF(B147=\"\",\"\",VLOOKUP(B147,Índices!$A:$H,5,0)),\"\")","v":""},{"$f":"IFERROR(IF(B147=\"\",\"\",VLOOKUP(B147,Índices!$A:$H,6,0)),\"\")","v":""},{"$f":"IFERROR(IF(B147=\"\",\"\",$C$10*VLOOKUP(B147,Índices!$A:$H,7,0)/VLOOKUP(EDATE($C$8,-1),Índices!$A:$H,7,0)),\"\")","v":""},{"$f":"IFERROR(IF(B147=\"\",\"\",E147*(VLOOKUP(B147,Índices!$A:$H,8,0)-VLOOKUP(EDATE($C$8,-1),Índices!$A:$H,8,0))),\"\")","v":""},null,"vazia"]
[null,{"$f":"IFERROR(IF(EDATE($C$8,127)>$C$9,\"\",IF(EDATE($C$8,127)>DATE(2099,12,1),\"\",EDATE($C$8,127))),\"\")","v":""},{"$f":"IFERROR(IF(B148=\"\",\"\",VLOOKUP(B148,Índices!$A:$H,5,0)),\"\")","v":""},{"$f":"IFERROR(IF(B148=\"\",\"\",VLOOKUP(B148,Índices!$A:$H,6,0)),\"\")","v":""},{"$f":"IFERROR(IF(B148=\"\",\"\",$C$10*VLOOKUP(B148,Índices!$A:$H,7,0)/VLOOKUP(EDATE($C$8,-1),Índices!$A:$H,7,0)),\"\")","v":""},{"$f":"IFERROR(IF(B148=\"\",\"\",E148*(VLOOKUP(B148,Índices!$A:$H,8,0)-VLOOKUP(EDATE($C$8,-1),Índices!$A:$H,8,0))),\"\")","v":""},null,"vazia"]
[null,{"$f":"IFERROR(IF(EDATE($C$8,128)>$C$9,\"\",IF(EDATE($C$8,128)>DATE(2099,12,1),\"\",EDATE($C$8,128))),\"\")","v":""},{"$f":"IFERROR(IF(B149=\"\",\"\",VLOOKUP(B149,Índices!$A:$H,5,0)),\"\")","v":""},{"$f":"IFERROR(IF(B149=\"\",\"\",VLOOKUP(B149,Índices!$A:$H,6,0)),\"\")","v":""},{"$f":"IFERROR(IF(B149=\"\",\"\",$C$10*VLOOKUP(B149,Índices!$A:$H,7,0)/VLOOKUP(EDATE($C$8,-1),Índices!$A:$H,7,0)),\"\")","v":""},{"$f":"IFERROR(IF(B149=\"\",\"\",E149*(VLOOKUP(B149,Índices!$A:$H,8,0)-VLOOKUP(EDATE($C$8,-1),Índices!$A:$H,8,0))),\"\")","v":""},null,"vazia"]
[null,{"$f":"IFERROR(IF(EDATE($C$8,129)>$C$9,\"\",IF(EDATE($C$8,129)>DATE(2099,12,1),\"\",EDATE($C$8,129))),\"\")","v":""},{"$f":"IFERROR(IF(B150=\"\",\"\",VLOOKUP(B150,Índices!$A:$H,5,0)),\"\")","v":""},{"$f":"IFERROR(IF(B150=\"\",\"\",VLOOKUP(B150,Índices!$A:$H,6,0)),\"\")","v":""},{"$f":"IFERROR(IF(B150=\"\",\"\",$C$10*VLOOKUP(B150,Índices!$A:$H,7,0)/VLOOKUP(EDATE($C$8,-1),Índices!$A:$H,7,0)),\"\")","v":""},{"$f":"IFERROR(IF(B150=\"\",\"\",E150*(VLOOKUP(B150,Índices!$A:$H,8,0)-VLOOKUP(EDATE($C$8,-1),Índices!$A:$H,8,0))),\"\")","v":""},null,{"$f":"IF(B150=\"\",\"vazia\",\"1\")","v":"vazia"}]
[null,{"$f":"IFERROR(IF(EDATE($C$8,130)>$C$9,\"\",IF(EDATE($C$8,130)>DATE(2099,12,1),\"\",EDATE($C$8,130))),\"\")","v":""},{"$f":"IFERROR(IF(B151=\"\",\"\",VLOOKUP(B151,Índices!$A:$H,5,0)),\"\")","v":""},{"$f":"IFERROR(IF(B151=\"\",\"\",VLOOKUP(B151,Índices!$A:$H,6,0)),\"\")","v":""},{"$f":"IFERROR(IF(B151=\"\",\"\",$C$10*VLOOKUP(B151,Índices!$A:$H,7,0)/VLOOKUP(EDATE($C$8,-1),Índices!$A:$H,7,0)),\"\")","v":""},{"$f":"IFERROR(IF(B151=\"\",\"\",E151*(VLOOKUP(B151,Índices!$A:$H,8,0)-VLOOKUP(EDATE($C$8,-1),Índices!$A:$H,8,0))),\"\")","v":""},null,"vazia"]
[null,{"$f":"IFERROR(IF(EDATE($C$8,131)>$C$9,\"\",IF(EDATE($C$8,131)>DATE(2099,12,1),\"\",EDATE($C$8,131))),\"\")","v":""},{"$f":"IFERROR(IF(B152=\"\",\"\",VLOOKUP(B152,Índices!$A:$H,5,0)),\"\")","v":""},{"$f":"IFERROR(IF(B152=\"\",\"\",VLOOKUP(B152,Índices!$A:$H,6,0)),\"\")","v":""},{"$f":"IFERROR(IF(B152=\"\",\"\",$C$10*VLOOKUP(B152,Índices!$A:$H,7,0)/VLOOKUP(EDATE($C$8,-1),Índices!$A:$H,7,0)),\"\")","v":""},{"$f":"IFERROR(IF(B152=\"\",\"\",E152*(VLOOKUP(B152,Índices!$A:$H,8,0)-VLOOKUP(EDATE($C$8,-1),Índices!$A:$H,8,0))),\"\")","v":""},null,"vazia"]
[null,{"$f":"IFERROR(IF(EDATE($C$8,132)>$C$9,\"\",IF(EDATE($C$8,132)>DATE(2099,12,1),\"\",EDATE($C$8,132))),\"\")","v":""},{"$f":"IFERROR(IF(B153=\"\",\"\",VLOOKUP(B153,Índices!$A:$H,5,0)),\"\")","v":""},{"$f":"IFERROR(IF(B153=\"\",\"\",VLOOKUP(B153,Índices!$A:$H,6,0)),\"\")","v":""},{"$f":"IFERROR(IF(B153=\"\",\"\",$C$10*VLOOKUP(B153,Índices!$A:$H,7,0)/VLOOKUP(EDATE($C$8,-1),Índices!$A:$H,7,0)),\"\")","v":""},{"$f":"IFERROR(IF(B153=\"\",\"\",E153*(VLOOKUP(B153,Índices!$A:$H,8,0)-VLOOKUP(EDATE($C$8,-1),Índices!$A:$H,8,0))),\"\")","v":""},null,"vazia"]
[null,{"$f":"IFERROR(IF(EDATE($C$8,133)>$C$9,\"\",IF(EDATE($C$8,133)>DATE(2099,12,1),\"\",EDATE($C$8,133))),\"\")","v":""},{"$f":"IFERROR(IF(B154=\"\",\"\",VLOOKUP(B154,Índices!$A:$H,5,0)),\"\")","v":""},{"$f":"IFERROR(IF(B154=\"\",\"\",VLOOKUP(B154,Índices!$A:$H,6,0)),\"\")","v":""},{"$f":"IFERROR(IF(B154=\"\",\"\",$C$10*VLOOKUP(B154,Índices!$A:$H,7,0)/VLOOKUP(EDATE($C$8,-1),Índices!$A:$H,7,0)),\"\")","v":""},{"$f":"IFERROR(IF(B154=\"\",\"\",E154*(VLOOKUP(B154,Índices!$A:$H,8,0)-VLOOKUP(EDATE($C$8,-1),Índices!$A:$H,8,0))),\"\")","v":""},null,"vazia"]
[null,{"$f":"IFERROR(IF(EDATE($C$8,134)>$C$9,\"\",IF(EDATE($C$8,134)>DATE(2099,12,1),\"\",EDATE($C$8,134))),\"\")","v":""},{"$f":"IFERROR(IF(B155=\"\",\"\",VLOOKUP(B155,Índices!$A:$H,5,0)),\"\")","v":""},{"$f":"IFERROR(IF(B155=\"\",\"\",VLOOKUP(B155,Índices!$A:$H,6,0)),\"\")","v":""},{"$f":"IFERROR(IF(B155=\"\",\"\",$C$10*VLOOKUP(B155,Índices!$A:$H,7,0)/VLOOKUP(EDATE($C$8,-1),Índices!$A:$H,7,0)),\"\")","v":""},{"$f":"IFERROR(IF(B155=\"\",\"\",E155*(VLOOKUP(B155,Índices!$A:$H,8,0)-VLOOKUP(EDATE($C$8,-1),Índices!$A:$H,8,0))),\"\")","v":""},null,"vazia"]
[null,{"$f":"IFERROR(IF(EDATE($C$8,135)>$C$9,\"\",IF(EDATE($C$8,135)>DATE(2099,12,1),\"\",EDATE($C$8,135))),\"\")","v":""},{"$f":"IFERROR(IF(B156=\"\",\"\",VLOOKUP(B156,Índices!$A:$H,5,0)),\"\")","v":""},{"$f":"IFERROR(IF(B156=\"\",\"\",VLOOKUP(B156,Índices!$A:$H,6,0)),\"\")","v":""},{"$f":"IFERROR(IF(B156=\"\",\"\",$C$10*VLOOKUP(B156,Índices!$A:$H,7,0)/VLOOKUP(EDATE($C$8,-1),Índices!$A:$H,7,0)),\"\")","v":""},{"$f":"IFERROR(IF(B156=\"\",\"\",E156*(VLOOKUP(B156,Índices!$A:$H,8,0)-VLOOKUP(EDATE($C$8,-1),Índices!$A:$H,8,0))),\"\")","v":""},null,"vazia"]
[null,{"$f":"IFERROR(IF(EDATE($C$8,136)>$C$9,\"\",IF(EDATE($C$8,136)>DATE(2099,12,1),\"\",EDATE($C$8,136))),\"\")","v":""},{"$f":"IFERROR(IF(B157=\"\",\"\",VLOOKUP(B157,Índices!$A:$H,5,0)),\"\")","v":""},{"$f":"IFERROR(IF(B157=\"\",\"\",VLOOKUP(B157,Índices!$A:$H,6,0)),\"\")","v":""},{"$f":"IFERROR(IF(B157=\"\",\"\",$C$10*VLOOKUP(B157,Índices!$A:$H,7,0)/VLOOKUP(EDATE($C$8,-1),Índices!$A:$H,7,0)),\"\")","v":""},{"$f":"IFERROR(IF(B157=\"\",\"\",E157*(VLOOKUP(B157,Índices!$A:$H,8,0)-VLOOKUP(EDATE($C$8,-1),Índices!$A:$H,8,0))),\"\")","v":""},null,"vazia"]
[null,{"$f":"IFERROR(IF(EDATE($C$8,137)>$C$9,\"\",IF(EDATE($C$8,137)>DATE(2099,12,1),\"\",EDATE($C$8,137))),\"\")","v":""},{"$f":"IFERROR(IF(B158=\"\",\"\",VLOOKUP(B158,Índices!$A:$H,5,0)),\"\")","v":""},{"$f":"IFERROR(IF(B158=\"\",\"\",VLOOKUP(B158,Índices!$A:$H,6,0)),\"\")","v":""},{"$f":"IFERROR(IF(B158=\"\",\"\",$C$10*VLOOKUP(B158,Índices!$A:$H,7,0)/VLOOKUP(EDATE($C$8,-1),Índices!$A:$H,7,0)),\"\")","v":""},{"$f":"IFERROR(IF(B158=\"\",\"\",E158*(VLOOKUP(B158,Índices!$A:$H,8,0)-VLOOKUP(EDATE($C$8,-1),Índices!$A:$H,8,0))),\"\")","v":""},null,"vazia"]
[null,{"$f":"IFERROR(IF(EDATE($C$8,138)>$C$9,\"\",IF(EDATE($C$8,138)>DATE(2099,12,1),\"\",EDATE($C$8,138))),\"\")","v":""},{"$f":"IFERROR(IF(B159=\"\",\"\",VLOOKUP(B159,Índices!$A:$H,5,0)),\"\")","v":""},{"$f":"IFERROR(IF(B159=\"\",\"\",VLOOKUP(B159,Índices!$A:$H,6,0)),\"\")","v":""},{"$f":"IFERROR(IF(B159=\"\",\"\",$C$10*VLOOKUP(B159,Índices!$A:$H,7,0)/VLOOKUP(EDATE($C$8,-1),Índices!$A:$H,7,0)),\"\")","v":""},{"$f":"IFERROR(IF(B159=\"\",\"\",E159*(VLOOKUP(B159,Índices!$A:$H,8,0)-VLOOKUP(EDATE($C$8,-1),Índices!$A:$H,8,0))),\"\")","v":""},null,"vazia"]
[null,{"$f":"IFERROR(IF(EDATE($C$8,139)>$C$9,\"\",IF(EDATE($C$8,139)>DATE(2099,12,1),\"\",EDATE($C$8,139))),\"\")","v":""},{"$f":"IFERROR(IF(B160=\"\",\"\",VLOOKUP(B160,Índices!$A:$H,5,0)),\"\")","v":""},{"$f":"IFERROR(IF(B160=\"\",\"\",VLOOKUP(B160,Índices!$A:$H,6,0)),\"\")","v":""},{"$f":"IFERROR(IF(B160=\"\",\"\",$C$10*VLOOKUP(B160,Índices!$A:$H,7,0)/VLOOKUP(EDATE($C$8,-1),Índices!$A:$H,7,0)),\"\")","v":""},{"$f":"IFERROR(IF(B160=\"\",\"\",E160*(VLOOKUP(B160,Índices!$A:$H,8,0)-VLOOKUP(EDATE($C$8,-1),Índices!$A:$H,8,0))),\"\")","v":""},null,"vazia"]
[null,{"$f":"IFERROR(IF(EDATE($C$8,140)>$C$9,\"\",IF(EDATE($C$8,140)>DATE(2099,12,1),\"\",EDATE($C$8,140))),\"\")","v":""},{"$f":"IFERROR(IF(B161=\"\",\"\",VLOOKUP(B161,Índices!$A:$H,5,0)),\"\")","v":""},{"$f":"IFERROR(IF(B161=\"\",\"\",VLOOKUP(B161,Índices!$A:$H,6,0)),\"\")","v":""},{"$f":"IFERROR(IF(B161=\"\",\"\",$C$10*VLOOKUP(B161,Índices!$A:$H,7,0)/VLOOKUP(EDATE($C$8,-1),Índices!$A:$H,7,0)),\"\")","v":""},{"$f":"IFERROR(IF(B161=\"\",\"\",E161*(VLOOKUP(B161,Índices!$A:$H,8,0)-VLOOKUP(EDATE($C$8,-1),Índices!$A:$H,8,0))),\"\")","v":""},null,"vazia"]
[null,{"$f":"IFERROR(IF(EDATE($C$8,141)>$C$9,\"\",IF(EDATE($C$8,141)>DATE(2099,12,1),\"\",EDATE($C$8,141))),\"\")","v":""},{"$f":"IFERROR(IF(B162=\"\",\"\",VLOOKUP(B162,Índices!$A:$H,5,0)),\"\")","v":""},{"$f":"IFERROR(IF(B162=\"\",\"\",VLOOKUP(B162,Índices!$A:$H,6,0)),\"\")","v":""},{"$f":"IFERROR(IF(B162=\"\",\"\",$C$10*VLOOKUP(B162,Índices!$A:$H,7,0)/VLOOKUP(EDATE($C$8,-1),Índices!$A:$H,7,0)),\"\")","v":""},{"$f":"IFERROR(IF(B162=\"\",\"\",E162*(VLOOKUP(B162,Índices!$A:$H,8,0)-VLOOKUP(EDATE($C$8,-1),Índices!$A:$H,8,0))),\"\")","v":""},null,"vazia"]
[null,{"$f":"IFERROR(IF(EDATE($C$8,142)>$C$9,\"\",IF(EDATE($C$8,142)>DATE(2099,12,1),\"\",EDATE($C$8,142))),\"\")","v":""},{"$f":"IFERROR(IF(B163=\"\",\"\",VLOOKUP(B163,Índices!$A:$H,5,0)),\"\")","v":""},{"$f":"IFERROR(IF(B163=\"\",\"\",VLOOKUP(B163,Índices!$A:$H,6,0)),\"\")","v":""},{"$f":"IFERROR(IF(B163=\"\",\"\",$C$10*VLOOKUP(B163,Índices!$A:$H,7,0)/VLOOKUP(EDATE($C$8,-1),Índices!$A:$H,7,0)),\"\")","v":""},{"$f":"IFERROR(IF(B163=\"\",\"\",E163*(VLOOKUP(B163,Índices!$A:$H,8,0)-VLOOKUP(EDATE($C$8,-1),Índices!$A:$H,8,0))),\"\")","v":""},null,"vazia"]
[null,{"$f":"IFERROR(IF(EDATE($C$8,143)>$C$9,\"\",IF(EDATE($C$8,143)>DATE(2099,12,1),\"\",EDATE($C$8,143))),\"\")","v":""},{"$f":"IFERROR(IF(B164=\"\",\"\",VLOOKUP(B164,Índices!$A:$H,5,0)),\"\")","v":""},{"$f":"IFERROR(IF(B164=\"\",\"\",VLOOKUP(B164,Índices!$A:$H,6,0)),\"\")","v":""},{"$f":"IFERROR(IF(B164=\"\",\"\",$C$10*VLOOKUP(B164,Índices!$A:$H,7,0)/VLOOKUP(EDATE($C$8,-1),Índices!$A:$H,7,0)),\"\")","v":""},{"$f":"IFERROR(IF(B164=\"\",\"\",E164*(VLOOKUP(B164,Índices!$A:$H,8,0)-VLOOKUP(EDATE($C$8,-1),Índices!$A:$H,8,0))),\"\")","v":""},null,"vazia"]
[null,{"$f":"IFERROR(IF(EDATE($C$8,144)>$C$9,\"\",IF(EDATE($C$8,144)>DATE(2099,12,1),\"\",EDATE($C$8,144))),\"\")","v":""},{"$f":"IFERROR(IF(B165=\"\",\"\",VLOOKUP(B165,Índices!$A:$H,5,0)),\"\")","v":""},{"$f":"IFERROR(IF(B165=\"\",\"\",VLOOKUP(B165,Índices!$A:$H,6,0)),\"\")","v":""},{"$f":"IFERROR(IF(B165=\"\",\"\",$C$10*VLOOKUP(B165,Índices!$A:$H,7,0)/VLOOKUP(EDATE($C$8,-1),Índices!$A:$H,7,0)),\"\")","v":""},{"$f":"IFERROR(IF(B165=\"\",\"\",E165*(VLOOKUP(B165,Índices!$A:$H,8,0)-VLOOKUP(EDATE($C$8,-1),Índices!$A:$H,8,0))),\"\")","v":""},null,"vazia"]
[null,{"$f":"IFERROR(IF(EDATE($C$8,145)>$C$9,\"\",IF(EDATE($C$8,145)>DATE(2099,12,1),\"\",EDATE($C$8,145))),\"\")","v":""},{"$f":"IFERROR(IF(B166=\"\",\"\",VLOOKUP(B166,Índices!$A:$H,5,0)),\"\")","v":""},{"$f":"IFERROR(IF(B166=\"\",\"\",VLOOKUP(B166,Índices!$A:$H,6,0)),\"\")","v":""},{"$f":"IFERROR(IF(B166=\"\",\"\",$C$10*VLOOKUP(B166,Índices!$A:$H,7,0)/VLOOKUP(EDATE($C$8,-1),Índices!$A:$H,7,0)),\"\")","v":""},{"$f":"IFERROR(IF(B166=\"\",\"\",E166*(VLOOKUP(B166,Índices!$A:$H,8,0)-VLOOKUP(EDATE($C$8,-1),Índices!$A:$H,8,0))),\"\")","v":""},null,"vazia"]
[null,{"$f":"IFERROR(IF(EDATE($C$8,146)>$C$9,\"\",IF(EDATE($C$8,146)>DATE(2099,12,1),\"\",EDATE($C$8,146))),\"\")","v":""},{"$f":"IFERROR(IF(B167=\"\",\"\",VLOOKUP(B167,Índices!$A:$H,5,0)),\"\")","v":""},{"$f":"IFERROR(IF(B167=\"\",\"\",VLOOKUP(B167,Índices!$A:$H,6,0)),\"\")","v":""},{"$f":"IFERROR(IF(B167=\"\",\"\",$C$10*VLOOKUP(B167,Índices!$A:$H,7,0)/VLOOKUP(EDATE($C$8,-1),Índices!$A:$H,7,0)),\"\")","v":""},{"$f":"IFERROR(IF(B167=\"\",\"\",E167*(VLOOKUP(B167,Índices!$A:$H,8,0)-VLOOKUP(EDATE($C$8,-1),Índices!$A:$H,8,0))),\"\")","v":""},null,"vazia"]
[null,{"$f":"IFERROR(IF(EDATE($C$8,147)>$C$9,\"\",IF(EDATE($C$8,147)>DATE(2099,12,1),\"\",EDATE($C$8,147))),\"\")","v":""},{"$f":"IFERROR(IF(B168=\"\",\"\",VLOOKUP(B168,Índices!$A:$H,5,0)),\"\")","v":""},{"$f":"IFERROR(IF(B168=\"\",\"\",VLOOKUP(B168,Índices!$A:$H,6,0)),\"\")","v":""},{"$f":"IFERROR(IF(B168=\"\",\"\",$C$10*VLOOKUP(B168,Índices!$A:$H,7,0)/VLOOKUP(EDATE($C$8,-1),Índices!$A:$H,7,0)),\"\")","v":""},{"$f":"IFERROR(IF(B168=\"\",\"\",E168*(VLOOKUP(B168,Índices!$A:$H,8,0)-VLOOKUP(EDATE($C$8,-1),Índices!$A:$H,8,0))),\"\")","v":""},null,"vazia"]
[null,{"$f":"IFERROR(IF(EDATE($C$8,148)>$C$9,\"\",IF(EDATE($C$8,148)>DATE(2099,12,1),\"\",EDATE($C$8,148))),\"\")","v":""},{"$f":"IFERROR(IF(B169=\"\",\"\",VLOOKUP(B169,Índices!$A:$H,5,0)),\"\")","v":""},{"$f":"IFERROR(IF(B169=\"\",\"\",VLOOKUP(B169,Índices!$A:$H,6,0)),\"\")","v":""},{"$f":"IFERROR(IF(B169=\"\",\"\",$C$10*VLOOKUP(B169,Índices!$A:$H,7,0)/VLOOKUP(EDATE($C$8,-1),Índices!$A:$H,7,0)),\"\")","v":""},{"$f":"IFERROR(IF(B169=\"\",\"\",E169*(VLOOKUP(B169,Índices!$A:$H,8,0)-VLOOKUP(EDATE($C$8,-1),Índices!$A:$H,8,0))),\"\")","v":""},null,"vazia"]
[null,{"$f":"IFERROR(IF(EDATE($C$8,149)>$C$9,\"\",IF(EDATE($C$8,149)>DATE(2099,12,1),\"\",EDATE($C$8,149))),\"\")","v":""},{"$f":"IFERROR(IF(B170=\"\",\"\",VLOOKUP(B170,Índices!$A:$H,5,0)),\"\")","v":""},{"$f":"IFERROR(IF(B170=\"\",\"\",VLOOKUP(B170,Índices!$A:$H,6,0)),\"\")","v":""},{"$f":"IFERROR(IF(B170=\"\",\"\",$C$10*VLOOKUP(B170,Índices!$A:$H,7,0)/VLOOKUP(EDATE($C$8,-1),Índices!$A:$H,7,0)),\"\")","v":""},{"$f":"IFERROR(IF(B170=\"\",\"\",E170*(VLOOKUP(B170,Índices!$A:$H,8,0)-VLOOKUP(EDATE($C$8,-1),Índices!$A:$H,8,0))),\"\")","v":""},null,"vazia"]
[null,{"$f":"IFERROR(IF(EDATE($C$8,150)>$C$9,\"\",IF(EDATE($C$8,150)>DATE(2099,12,1),\"\",EDATE($C$8,150))),\"\")","v":""},{"$f":"IFERROR(IF(B171=\"\",\"\",VLOOKUP(B171,Índices!$A:$H,5,0)),\"\")","v":""},{"$f":"IFERROR(IF(B171=\"\",\"\",VLOOKUP(B171,Índices!$A:$H,6,0)),\"\")","v":""},{"$f":"IFERROR(IF(B171=\"\",\"\",$C$10*VLOOKUP(B171,Índices!$A:$H,7,0)/VLOOKUP(EDATE($C$8,-1),Índices!$A:$H,7,0)),\"\")","v":""},{"$f":"IFERROR(IF(B171=\"\",\"\",E171*(VLOOKUP(B171,Índices!$A:$H,8,0)-VLOOKUP(EDATE($C$8,-1),Índices!$A:$H,8,0))),\"\")","v":""},null,"vazia"]
[null,{"$f":"IFERROR(IF(EDATE($C$8,151)>$C$9,\"\",IF(EDATE($C$8,151)>DATE(2099,12,1),\"\",EDATE($C$8,151))),\"\")","v":""},{"$f":"IFERROR(IF(B172=\"\",\"\",VLOOKUP(B172,Índices!$A:$H,5,0)),\"\")","v":""},{"$f":"IFERROR(IF(B172=\"\",\"\",VLOOKUP(B172,Índices!$A:$H,6,0)),\"\")","v":""},{"$f":"IFERROR(IF(B172=\"\",\"\",$C$10*VLOOKUP(B172,Índices!$A:$H,7,0)/VLOOKUP(EDATE($C$8,-1),Índices!$A:$H,7,0)),\"\")","v":""},{"$f":"IFERROR(IF(B172=\"\",\"\",E172*(VLOOKUP(B172,Índices!$A:$H,8,0)-VLOOKUP(EDATE($C$8,-1),Índices!$A:$H,8,0))),\"\")","v":""},null,"vazia"]
[null,{"$f":"IFERROR(IF(EDATE($C$8,152)>$C$9,\"\",IF(EDATE($C$8,152)>DATE(2099,12,1),\"\",EDATE($C$8,152))),\"\")","v":""},{"$f":"IFERROR(IF(B173=\"\",\"\",VLOOKUP(B173,Índices!$A:$H,5,0)),\"\")","v":""},{"$f":"IFERROR(IF(B173=\"\",\"\",VLOOKUP(B173,Índices!$A:$H,6,0)),\"\")","v":""},{"$f":"IFERROR(IF(B173=\"\",\"\",$C$10*VLOOKUP(B173,Índices!$A:$H,7,0)/VLOOKUP(EDATE($C$8,-1),Índices!$A:$H,7,0)),\"\")","v":""},{"$f":"IFERROR(IF(B173=\"\",\"\",E173*(VLOOKUP(B173,Índices!$A:$H,8,0)-VLOOKUP(EDATE($C$8,-1),Índices!$A:$H,8,0))),\"\")","v":""},null,"vazia"]
[null,{"$f":"IFERROR(IF(EDATE($C$8,153)>$C$9,\"\",IF(EDATE($C$8,153)>DATE(2099,12,1),\"\",EDATE($C$8,153))),\"\")","v":""},{"$f":"IFERROR(IF(B174=\"\",\"\",VLOOKUP(B174,Índices!$A:$H,5,0)),\"\")","v":""},{"$f":"IFERROR(IF(B174=\"\",\"\",VLOOKUP(B174,Índices!$A:$H,6,0)),\"\")","v":""},{"$f":"IFERROR(IF(B174=\"\",\"\",$C$10*VLOOKUP(B174,Índices!$A:$H,7,0)/VLOOKUP(EDATE($C$8,-1),Índices!$A:$H,7,0)),\"\")","v":""},{"$f":"IFERROR(IF(B174=\"\",\"\",E174*(VLOOKUP(B174,Índices!$A:$H,8,0)-VLOOKUP(EDATE($C$8,-1),Índices!$A:$H,8,0))),\"\")","v":""},null,"vazia"]
[null,{"$f":"IFERROR(IF(EDATE($C$8,154)>$C$9,\"\",IF(EDATE($C$8,154)>DATE(2099,12,1),\"\",EDATE($C$8,154))),\"\")","v":""},{"$f":"IFERROR(IF(B175=\"\",\"\",VLOOKUP(B175,Índices!$A:$H,5,0)),\"\")","v":""},{"$f":"IFERROR(IF(B175=\"\",\"\",VLOOKUP(B175,Índices!$A:$H,6,0)),\"\")","v":""},{"$f":"IFERROR(IF(B175=\"\",\"\",$C$10*VLOOKUP(B175,Índices!$A:$H,7,0)/VLOOKUP(EDATE($C$8,-1),Índices!$A:$H,7,0)),\"\")","v":""},{"$f":"IFERROR(IF(B175=\"\",\"\",E175*(VLOOKUP(B175,Índices!$A:$H,8,0)-VLOOKUP(EDATE($C$8,-1),Índices!$A:$H,8,0))),\"\")","v":""},null,"vazia"]
[null,{"$f":"IFERROR(IF(EDATE($C$8,155)>$C$9,\"\",IF(EDATE($C$8,155)>DATE(2099,12,1),\"\",EDATE($C$8,155))),\"\")","v":""},{"$f":"IFERROR(IF(B176=\"\",\"\",VLOOKUP(B176,Índices!$A:$H,5,0)),\"\")","v":""},{"$f":"IFERROR(IF(B176=\"\",\"\",VLOOKUP(B176,Índices!$A:$H,6,0)),\"\")","v":""},{"$f":"IFERROR(IF(B176=\"\",\"\",$C$10*VLOOKUP(B176,Índices!$A:$H,7,0)/VLOOKUP(EDATE($C$8,-1),Índices!$A:$H,7,0)),\"\")","v":""},{"$f":"IFERROR(IF(B176=\"\",\"\",E176*(VLOOKUP(B176,Índices!$A:$H,8,0)-VLOOKUP(EDATE($C$8,-1),Índices!$A:$H,8,0))),\"\")","v":""},null,"vazia"]
[null,{"$f":"IFERROR(IF(EDATE($C$8,156)>$C$9,\"\",IF(EDATE($C$8,156)>DATE(2099,12,1),\"\",EDATE($C$8,156))),\"\")","v":""},{"$f":"IFERROR(IF(B177=\"\",\"\",VLOOKUP(B177,Índices!$A:$H,5,0)),\"\")","v":""},{"$f":"IFERROR(IF(B177=\"\",\"\",VLOOKUP(B177,Índices!$A:$H,6,0)),\"\")","v":""},{"$f":"IFERROR(IF(B177=\"\",\"\",$C$10*VLOOKUP(B177,Índices!$A:$H,7,0)/VLOOKUP(EDATE($C$8,-1),Índices!$A:$H,7,0)),\"\")","v":""},{"$f":"IFERROR(IF(B177=\"\",\"\",E177*(VLOOKUP(B177,Índices!$A:$H,8,0)-VLOOKUP(EDATE($C$8,-1),Índices!$A:$H,8,0))),\"\")","v":""},null,"vazia"]
[null,{"$f":"IFERROR(IF(EDATE($C$8,157)>$C$9,\"\",IF(EDATE($C$8,157)>DATE(2099,12,1),\"\",EDATE($C$8,157))),\"\")","v":""},{"$f":"IFERROR(IF(B178=\"\",\"\",VLOOKUP(B178,Índices!$A:$H,5,0)),\"\")","v":""},{"$f":"IFERROR(IF(B178=\"\",\"\",VLOOKUP(B178,Índices!$A:$H,6,0)),\"\")","v":""},{"$f":"IFERROR(IF(B178=\"\",\"\",$C$10*VLOOKUP(B178,Índices!$A:$H,7,0)/VLOOKUP(EDATE($C$8,-1),Índices!$A:$H,7,0)),\"\")","v":""},{"$f":"IFERROR(IF(B178=\"\",\"\",E178*(VLOOKUP(B178,Índices!$A:$H,8,0)-VLOOKUP(EDATE($C$8,-1),Índices!$A:$H,8,0))),\"\")","v":""},null,"vazia"]
[null,{"$f":"IFERROR(IF(EDATE($C$8,158)>$C$9,\"\",IF(EDATE($C$8,158)>DATE(2099,12,1),\"\",EDATE($C$8,158))),\"\")","v":""},{"$f":"IFERROR(IF(B179=\"\",\"\",VLOOKUP(B179,Índices!$A:$H,5,0)),\"\")","v":""},{"$f":"IFERROR(IF(B179=\"\",\"\",VLOOKUP(B179,Índices!$A:$H,6,0)),\"\")","v":""},{"$f":"IFERROR(IF(B179=\"\",\"\",$C$10*VLOOKUP(B179,Índices!$A:$H,7,0)/VLOOKUP(EDATE($C$8,-1),Índices!$A:$H,7,0)),\"\")","v":""},{"$f":"IFERROR(IF(B179=\"\",\"\",E179*(VLOOKUP(B179,Índices!$A:$H,8,0)-VLOOKUP(EDATE($C$8,-1),Índices!$A:$H,8,0))),\"\")","v":""},null,"vazia"]
[null,{"$f":"IFERROR(IF(EDATE($C$8,159)>$C$9,\"\",IF(EDATE($C$8,159)>DATE(2099,12,1),\"\",EDATE($C$8,159))),\"\")","v":""},{"$f":"IFERROR(IF(B180=\"\",\"\",VLOOKUP(B180,Índices!$A:$H,5,0)),\"\")","v":""},{"$f":"IFERROR(IF(B180=\"\",\"\",VLOOKUP(B180,Índices!$A:$H,6,0)),\"\")","v":""},{"$f":"IFERROR(IF(B180=\"\",\"\",$C$10*VLOOKUP(B180,Índices!$A:$H,7,0)/VLOOKUP(EDATE($C$8,-1),Índices!$A:$H,7,0)),\"\")","v":""},{"$f":"IFERROR(IF(B180=\"\",\"\",E180*(VLOOKUP(B180,Índices!$A:$H,8,0)-VLOOKUP(EDATE($C$8,-1),Índices!$A:$H,8,0))),\"\")","v":""},null,"vazia"]
[null,{"$f":"IFERROR(IF(EDATE($C$8,160)>$C$9,\"\",IF(EDATE($C$8,160)>DATE(2099,12,1),\"\",EDATE($C$8,160))),\"\")","v":""},{"$f":"IFERROR(IF(B181=\"\",\"\",VLOOKUP(B181,Índices!$A:$H,5,0)),\"\")","v":""},{"$f":"IFERROR(IF(B181=\"\",\"\",VLOOKUP(B181,Índices!$A:$H,6,0)),\"\")","v":""},{"$f":"IFERROR(IF(B181=\"\",\"\",$C$10*VLOOKUP(B181,Índices!$A:$H,7,0)/VLOOKUP(EDATE($C$8,-1),Índices!$A:$H,7,0)),\"\")","v":""},{"$f":"IFERROR(IF(B181=\"\",\"\",E181*(VLOOKUP(B181,Índices!$A:$H,8,0)-VLOOKUP(EDATE($C$8,-1),Índices!$A:$H,8,0))),\"\")","v":""},null,"vazia"]
[null,{"$f":"IFERROR(IF(EDATE($C$8,161)>$C$9,\"\",IF(EDATE($C$8,161)>DATE(2099,12,1),\"\",EDATE($C$8,161))),\"\")","v":""},{"$f":"IFERROR(IF(B182=\"\",\"\",VLOOKUP(B182,Índices!$A:$H,5,0)),\"\")","v":""},{"$f":"IFERROR(IF(B182=\"\",\"\",VLOOKUP(B182,Índices!$A:$H,6,0)),\"\")","v":""},{"$f":"IFERROR(IF(B182=\"\",\"\",$C$10*VLOOKUP(B182,Índices!$A:$H,7,0)/VLOOKUP(EDATE($C$8,-1),Índices!$A:$H,7,0)),\"\")","v":""},{"$f":"IFERROR(IF(B182=\"\",\"\",E182*(VLOOKUP(B182,Índices!$A:$H,8,0)-VLOOKUP(EDATE($C$8,-1),Índices!$A:$H,8,0))),\"\")","v":""},null,"vazia"]
[null,{"$f":"IFERROR(IF(EDATE($C$8,162)>$C$9,\"\",IF(EDATE($C$8,162)>DATE(2099,12,1),\"\",EDATE($C$8,162))),\"\")","v":""},{"$f":"IFERROR(IF(B183=\"\",\"\",VLOOKUP(B183,Índices!$A:$H,5,0)),\"\")","v":""},{"$f":"IFERROR(IF(B183=\"\",\"\",VLOOKUP(B183,Índices!$A:$H,6,0)),\"\")","v":""},{"$f":"IFERROR(IF(B183=\"\",\"\",$C$10*VLOOKUP(B183,Índices!$A:$H,7,0)/VLOOKUP(EDATE($C$8,-1),Índices!$A:$H,7,0)),\"\")","v":""},{"$f":"IFERROR(IF(B183=\"\",\"\",E183*(VLOOKUP(B183,Índices!$A:$H,8,0)-VLOOKUP(EDATE($C$8,-1),Índices!$A:$H,8,0))),\"\")","v":""},null,"vazia"]
[null,{"$f":"IFERROR(IF(EDATE($C$8,163)>$C$9,\"\",IF(EDATE($C$8,163)>DATE(2099,12,1),\"\",EDATE($C$8,163))),\"\")","v":""},{"$f":"IFERROR(IF(B184=\"\",\"\",VLOOKUP(B184,Índices!$A:$H,5,0)),\"\")","v":""},{"$f":"IFERROR(IF(B184=\"\",\"\",VLOOKUP(B184,Índices!$A:$H,6,0)),\"\")","v":""},{"$f":"IFERROR(IF(B184=\"\",\"\",$C$10*VLOOKUP(B184,Índices!$A:$H,7,0)/VLOOKUP(EDATE($C$8,-1),Índices!$A:$H,7,0)),\"\")","v":""},{"$f":"IFERROR(IF(B184=\"\",\"\",E184*(VLOOKUP(B184,Índices!$A:$H,8,0)-VLOOKUP(EDATE($C$8,-1),Índices!$A:$H,8,0))),\"\")","v":""},null,"vazia"]
[null,{"$f":"IFERROR(IF(EDATE($C$8,164)>$C$9,\"\",IF(EDATE($C$8,164)>DATE(2099,12,1),\"\",EDATE($C$8,164))),\"\")","v":""},{"$f":"IFERROR(IF(B185=\"\",\"\",VLOOKUP(B185,Índices!$A:$H,5,0)),\"\")","v":""},{"$f":"IFERROR(IF(B185=\"\",\"\",VLOOKUP(B185,Índices!$A:$H,6,0)),\"\")","v":""},{"$f":"IFERROR(IF(B185=\"\",\"\",$C$10*VLOOKUP(B185,Índices!$A:$H,7,0)/VLOOKUP(EDATE($C$8,-1),Índices!$A:$H,7,0)),\"\")","v":""},{"$f":"IFERROR(IF(B185=\"\",\"\",E185*(VLOOKUP(B185,Índices!$A:$H,8,0)-VLOOKUP(EDATE($C$8,-1),Índices!$A:$H,8,0))),\"\")","v":""},null,"vazia"]
[null,{"$f":"IFERROR(IF(EDATE($C$8,165)>$C$9,\"\",IF(EDATE($C$8,165)>DATE(2099,12,1),\"\",EDATE($C$8,165))),\"\")","v":""},{"$f":"IFERROR(IF(B186=\"\",\"\",VLOOKUP(B186,Índices!$A:$H,5,0)),\"\")","v":""},{"$f":"IFERROR(IF(B186=\"\",\"\",VLOOKUP(B186,Índices!$A:$H,6,0)),\"\")","v":""},{"$f":"IFERROR(IF(B186=\"\",\"\",$C$10*VLOOKUP(B186,Índices!$A:$H,7,0)/VLOOKUP(EDATE($C$8,-1),Índices!$A:$H,7,0)),\"\")","v":""},{"$f":"IFERROR(IF(B186=\"\",\"\",E186*(VLOOKUP(B186,Índices!$A:$H,8,0)-VLOOKUP(EDATE($C$8,-1),Índices!$A:$H,8,0))),\"\")","v":""},null,"vazia"]
[null,{"$f":"IFERROR(IF(EDATE($C$8,166)>$C$9,\"\",IF(EDATE($C$8,166)>DATE(2099,12,1),\"\",EDATE($C$8,166))),\"\")","v":""},{"$f":"IFERROR(IF(B187=\"\",\"\",VLOOKUP(B187,Índices!$A:$H,5,0)),\"\")","v":""},{"$f":"IFERROR(IF(B187=\"\",\"\",VLOOKUP(B187,Índices!$A:$H,6,0)),\"\")","v":""},{"$f":"IFERROR(IF(B187=\"\",\"\",$C$10*VLOOKUP(B187,Índices!$A:$H,7,0)/VLOOKUP(EDATE($C$8,-1),Índices!$A:$H,7,0)),\"\")","v":""},{"$f":"IFERROR(IF(B187=\"\",\"\",E187*(VLOOKUP(B187,Índices!$A:$H,8,0)-VLOOKUP(EDATE($C$8,-1),Índices!$A:$H,8,0))),\"\")","v":""},null,"vazia"]
[null,{"$f":"IFERROR(IF(EDATE($C$8,167)>$C$9,\"\",IF(EDATE($C$8,167)>DATE(2099,12,1),\"\",EDATE($C$8,167))),\"\")","v":""},{"$f":"IFERROR(IF(B188=\"\",\"\",VLOOKUP(B188,Índices!$A:$H,5,0)),\"\")","v":""},{"$f":"IFERROR(IF(B188=\"\",\"\",VLOOKUP(B188,Índices!$A:$H,6,0)),\"\")","v":""},{"$f":"IFERROR(IF(B188=\"\",\"\",$C$10*VLOOKUP(B188,Índices!$A:$H,7,0)/VLOOKUP(EDATE($C$8,-1),Índices!$A:$H,7,0)),\"\")","v":""},{"$f":"IFERROR(IF(B188=\"\",\"\",E188*(VLOOKUP(B188,Índices!$A:$H,8,0)-VLOOKUP(EDATE($C$8,-1),Índices!$A:$H,8,0))),\"\")","v":""},null,"vazia"]
[null,{"$f":"IFERROR(IF(EDATE($C$8,168)>$C$9,\"\",IF(EDATE($C$8,168)>DATE(2099,12,1),\"\",EDATE($C$8,168))),\"\")","v":""},{"$f":"IFERROR(IF(B189=\"\",\"\",VLOOKUP(B189,Índices!$A:$H,5,0)),\"\")","v":""},{"$f":"IFERROR(IF(B189=\"\",\"\",VLOOKUP(B189,Índices!$A:$H,6,0)),\"\")","v":""},{"$f":"IFERROR(IF(B189=\"\",\"\",$C$10*VLOOKUP(B189,Índices!$A:$H,7,0)/VLOOKUP(EDATE($C$8,-1),Índices!$A:$H,7,0)),\"\")","v":""},{"$f":"IFERROR(IF(B189=\"\",\"\",E189*(VLOOKUP(B189,Índices!$A:$H,8,0)-VLOOKUP(EDATE($C$8,-1),Índices!$A:$H,8,0))),\"\")","v":""},null,"vazia"]
[null,{"$f":"IFERROR(IF(EDATE($C$8,169)>$C$9,\"\",IF(EDATE($C$8,169)>DATE(2099,12,1),\"\",EDATE($C$8,169))),\"\")","v":""},{"$f":"IFERROR(IF(B190=\"\",\"\",VLOOKUP(B190,Índices!$A:$H,5,0)),\"\")","v":""},{"$f":"IFERROR(IF(B190=\"\",\"\",VLOOKUP(B190,Índices!$A:$H,6,0)),\"\")","v":""},{"$f":"IFERROR(IF(B190=\"\",\"\",$C$10*VLOOKUP(B190,Índices!$A:$H,7,0)/VLOOKUP(EDATE($C$8,-1),Índices!$A:$H,7,0)),\"\")","v":""},{"$f":"IFERROR(IF(B190=\"\",\"\",E190*(VLOOKUP(B190,Índices!$A:$H,8,0)-VLOOKUP(EDATE($C$8,-1),Índices!$A:$H,8,0))),\"\")","v":""},null,"vazia"]
[null,{"$f":"IFERROR(IF(EDATE($C$8,170)>$C$9,\"\",IF(EDATE($C$8,170)>DATE(2099,12,1),\"\",EDATE($C$8,170))),\"\")","v":""},{"$f":"IFERROR(IF(B191=\"\",\"\",VLOOKUP(B191,Índices!$A:$H,5,0)),\"\")","v":""},{"$f":"IFERROR(IF(B191=\"\",\"\",VLOOKUP(B191,Índices!$A:$H,6,0)),\"\")","v":""},{"$f":"IFERROR(IF(B191=\"\",\"\",$C$10*VLOOKUP(B191,Índices!$A:$H,7,0)/VLOOKUP(EDATE($C$8,-1),Índices!$A:$H,7,0)),\"\")","v":""},{"$f":"IFERROR(IF(B191=\"\",\"\",E191*(VLOOKUP(B191,Índices!$A:$H,8,0)-VLOOKUP(EDATE($C$8,-1),Índices!$A:$H,8,0))),\"\")","v":""},null,"vazia"]
[null,{"$f":"IFERROR(IF(EDATE($C$8,171)>$C$9,\"\",IF(EDATE($C$8,171)>DATE(2099,12,1),\"\",EDATE($C$8,171))),\"\")","v":""},{"$f":"IFERROR(IF(B192=\"\",\"\",VLOOKUP(B192,Índices!$A:$H,5,0)),\"\")","v":""},{"$f":"IFERROR(IF(B192=\"\",\"\",VLOOKUP(B192,Índices!$A:$H,6,0)),\"\")","v":""},{"$f":"IFERROR(IF(B192=\"\",\"\",$C$10*VLOOKUP(B192,Índices!$A:$H,7,0)/VLOOKUP(EDATE($C$8,-1),Índices!$A:$H,7,0)),\"\")","v":""},{"$f":"IFERROR(IF(B192=\"\",\"\",E192*(VLOOKUP(B192,Índices!$A:$H,8,0)-VLOOKUP(EDATE($C$8,-1),Índices!$A:$H,8,0))),\"\")","v":""},null,"vazia"]
[null,{"$f":"IFERROR(IF(EDATE($C$8,172)>$C$9,\"\",IF(EDATE($C$8,172)>DATE(2099,12,1),\"\",EDATE($C$8,172))),\"\")","v":""},{"$f":"IFERROR(IF(B193=\"\",\"\",VLOOKUP(B193,Índices!$A:$H,5,0)),\"\")","v":""},{"$f":"IFERROR(IF(B193=\"\",\"\",VLOOKUP(B193,Índices!$A:$H,6,0)),\"\")","v":""},{"$f":"IFERROR(IF(B193=\"\",\"\",$C$10*VLOOKUP(B193,Índices!$A:$H,7,0)/VLOOKUP(EDATE($C$8,-1),Índices!$A:$H,7,0)),\"\")","v":""},{"$f":"IFERROR(IF(B193=\"\",\"\",E193*(VLOOKUP(B193,Índices!$A:$H,8,0)-VLOOKUP(EDATE($C$8,-1),Índices!$A:$H,8,0))),\"\")","v":""},null,"vazia"]
[null,{"$f":"IFERROR(IF(EDATE($C$8,173)>$C$9,\"\",IF(EDATE($C$8,173)>DATE(2099,12,1),\"\",EDATE($C$8,173))),\"\")","v":""},{"$f":"IFERROR(IF(B194=\"\",\"\",VLOOKUP(B194,Índices!$A:$H,5,0)),\"\")","v":""},{"$f":"IFERROR(IF(B194=\"\",\"\",VLOOKUP(B194,Índices!$A:$H,6,0)),\"\")","v":""},{"$f":"IFERROR(IF(B194=\"\",\"\",$C$10*VLOOKUP(B194,Índices!$A:$H,7,0)/VLOOKUP(EDATE($C$8,-1),Índices!$A:$H,7,0)),\"\")","v":""},{"$f":"IFERROR(IF(B194=\"\",\"\",E194*(VLOOKUP(B194,Índices!$A:$H,8,0)-VLOOKUP(EDATE($C$8,-1),Índices!$A:$H,8,0))),\"\")","v":""},null,"vazia"]
[null,{"$f":"IFERROR(IF(EDATE($C$8,174)>$C$9,\"\",IF(EDATE($C$8,174)>DATE(2099,12,1),\"\",EDATE($C$8,174))),\"\")","v":""},{"$f":"IFERROR(IF(B195=\"\",\"\",VLOOKUP(B195,Índices!$A:$H,5,0)),\"\")","v":""},{"$f":"IFERROR(IF(B195=\"\",\"\",VLOOKUP(B195,Índices!$A:$H,6,0)),\"\")","v":""},{"$f":"IFERROR(IF(B195=\"\",\"\",$C$10*VLOOKUP(B195,Índices!$A:$H,7,0)/VLOOKUP(EDATE($C$8,-1),Índices!$A:$H,7,0)),\"\")","v":""},{"$f":"IFERROR(IF(B195=\"\",\"\",E195*(VLOOKUP(B195,Índices!$A:$H,8,0)-VLOOKUP(EDATE($C$8,-1),Índices!$A:$H,8,0))),\"\")","v":""},null,"vazia"]
[null,{"$f":"IFERROR(IF(EDATE($C$8,175)>$C$9,\"\",IF(EDATE($C$8,175)>DATE(2099,12,1),\"\",EDATE($C$8,175))),\"\")","v":""},{"$f":"IFERROR(IF(B196=\"\",\"\",VLOOKUP(B196,Índices!$A:$H,5,0)),\"\")","v":""},{"$f":"IFERROR(IF(B196=\"\",\"\",VLOOKUP(B196,Índices!$A:$H,6,0)),\"\")","v":""},{"$f":"IFERROR(IF(B196=\"\",\"\",$C$10*VLOOKUP(B196,Índices!$A:$H,7,0)/VLOOKUP(EDATE($C$8,-1),Índices!$A:$H,7,0)),\"\")","v":""},{"$f":"IFERROR(IF(B196=\"\",\"\",E196*(VLOOKUP(B196,Índices!$A:$H,8,0)-VLOOKUP(EDATE($C$8,-1),Índices!$A:$H,8,0))),\"\")","v":""},null,"vazia"]
[null,{"$f":"IFERROR(IF(EDATE($C$8,176)>$C$9,\"\",IF(EDATE($C$8,176)>DATE(2099,12,1),\"\",EDATE($C$8,176))),\"\")","v":""},{"$f":"IFERROR(IF(B197=\"\",\"\",VLOOKUP(B197,Índices!$A:$H,5,0)),\"\")","v":""},{"$f":"IFERROR(IF(B197=\"\",\"\",VLOOKUP(B197,Índices!$A:$H,6,0)),\"\")","v":""},{"$f":"IFERROR(IF(B197=\"\",\"\",$C$10*VLOOKUP(B197,Índices!$A:$H,7,0)/VLOOKUP(EDATE($C$8,-1),Índices!$A:$H,7,0)),\"\")","v":""},{"$f":"IFERROR(IF(B197=\"\",\"\",E197*(VLOOKUP(B197,Índices!$A:$H,8,0)-VLOOKUP(EDATE($C$8,-1),Índices!$A:$H,8,0))),\"\")","v":""},null,"vazia"]
[null,{"$f":"IFERROR(IF(EDATE($C$8,177)>$C$9,\"\",IF(EDATE($C$8,177)>DATE(2099,12,1),\"\",EDATE($C$8,177))),\"\")","v":""},{"$f":"IFERROR(IF(B198=\"\",\"\",VLOOKUP(B198,Índices!$A:$H,5,0)),\"\")","v":""},{"$f":"IFERROR(IF(B198=\"\",\"\",VLOOKUP(B198,Índices!$A:$H,6,0)),\"\")","v":""},{"$f":"IFERROR(IF(B198=\"\",\"\",$C$10*VLOOKUP(B198,Índices!$A:$H,7,0)/VLOOKUP(EDATE($C$8,-1),Índices!$A:$H,7,0)),\"\")","v":""},{"$f":"IFERROR(IF(B198=\"\",\"\",E198*(VLOOKUP(B198,Índices!$A:$H,8,0)-VLOOKUP(EDATE($C$8,-1),Índices!$A:$H,8,0))),\"\")","v":""},null,"vazia"]
[null,{"$f":"IFERROR(IF(EDATE($C$8,178)>$C$9,\"\",IF(EDATE($C$8,178)>DATE(2099,12,1),\"\",EDATE($C$8,178))),\"\")","v":""},{"$f":"IFERROR(IF(B199=\"\",\"\",VLOOKUP(B199,Índices!$A:$H,5,0)),\"\")","v":""},{"$f":"IFERROR(IF(B199=\"\",\"\",VLOOKUP(B199,Índices!$A:$H,6,0)),\"\")","v":""},{"$f":"IFERROR(IF(B199=\"\",\"\",$C$10*VLOOKUP(B199,Índices!$A:$H,7,0)/VLOOKUP(EDATE($C$8,-1),Índices!$A:$H,7,0)),\"\")","v":""},{"$f":"IFERROR(IF(B199=\"\",\"\",E199*(VLOOKUP(B199,Índices!$A:$H,8,0)-VLOOKUP(EDATE($C$8,-1),Índices!$A:$H,8,0))),\"\")","v":""},null,"vazia"]
[null,{"$f":"IFERROR(IF(EDATE($C$8,179)>$C$9,\"\",IF(EDATE($C$8,179)>DATE(2099,12,1),\"\",EDATE($C$8,179))),\"\")","v":""},{"$f":"IFERROR(IF(B200=\"\",\"\",VLOOKUP(B200,Índices!$A:$H,5,0)),\"\")","v":""},{"$f":"IFERROR(IF(B200=\"\",\"\",VLOOKUP(B200,Índices!$A:$H,6,0)),\"\")","v":""},{"$f":"IFERROR(IF(B200=\"\",\"\",$C$10*VLOOKUP(B200,Índices!$A:$H,7,0)/VLOOKUP(EDATE($C$8,-1),Índices!$A:$H,7,0)),\"\")","v":""},{"$f":"IFERROR(IF(B200=\"\",\"\",E200*(VLOOKUP(B200,Índices!$A:$H,8,0)-VLOOKUP(EDATE($C$8,-1),Índices!$A:$H,8,0))),\"\")","v":""},null,"vazia"]
[null,{"$f":"IFERROR(IF(EDATE($C$8,180)>$C$9,\"\",IF(EDATE($C$8,180)>DATE(2099,12,1),\"\",EDATE($C$8,180))),\"\")","v":""},{"$f":"IFERROR(IF(B201=\"\",\"\",VLOOKUP(B201,Índices!$A:$H,5,0)),\"\")","v":""},{"$f":"IFERROR(IF(B201=\"\",\"\",VLOOKUP(B201,Índices!$A:$H,6,0)),\"\")","v":""},{"$f":"IFERROR(IF(B201=\"\",\"\",$C$10*VLOOKUP(B201,Índices!$A:$H,7,0)/VLOOKUP(EDATE($C$8,-1),Índices!$A:$H,7,0)),\"\")","v":""},{"$f":"IFERROR(IF(B201=\"\",\"\",E201*(VLOOKUP(B201,Índices!$A:$H,8,0)-VLOOKUP(EDATE($C$8,-1),Índices!$A:$H,8,0))),\"\")","v":""},null,"vazia"]
[null,{"$f":"IFERROR(IF(EDATE($C$8,181)>$C$9,\"\",IF(EDATE($C$8,181)>DATE(2099,12,1),\"\",EDATE($C$8,181))),\"\")","v":""},{"$f":"IFERROR(IF(B202=\"\",\"\",VLOOKUP(B202,Índices!$A:$H,5,0)),\"\")","v":""},{"$f":"IFERROR(IF(B202=\"\",\"\",VLOOKUP(B202,Índices!$A:$H,6,0)),\"\")","v":""},{"$f":"IFERROR(IF(B202=\"\",\"\",$C$10*VLOOKUP(B202,Índices!$A:$H,7,0)/VLOOKUP(EDATE($C$8,-1),Índices!$A:$H,7,0)),\"\")","v":""},{"$f":"IFERROR(IF(B202=\"\",\"\",E202*(VLOOKUP(B202,Índices!$A:$H,8,0)-VLOOKUP(EDATE($C$8,-1),Índices!$A:$H,8,0))),\"\")","v":""},null,"vazia"]
[null,{"$f":"IFERROR(IF(EDATE($C$8,182)>$C$9,\"\",IF(EDATE($C$8,182)>DATE(2099,12,1),\"\",EDATE($C$8,182))),\"\")","v":""},{"$f":"IFERROR(IF(B203=\"\",\"\",VLOOKUP(B203,Índices!$A:$H,5,0)),\"\")","v":""},{"$f":"IFERROR(IF(B203=\"\",\"\",VLOOKUP(B203,Índices!$A:$H,6,0)),\"\")","v":""},{"$f":"IFERROR(IF(B203=\"\",\"\",$C$10*VLOOKUP(B203,Índices!$A:$H,7,0)/VLOOKUP(EDATE($C$8,-1),Índices!$A:$H,7,0)),\"\")","v":""},{"$f":"IFERROR(IF(B203=\"\",\"\",E203*(VLOOKUP(B203,Índices!$A:$H,8,0)-VLOOKUP(EDATE($C$8,-1),Índices!$A:$H,8,0))),\"\")","v":""},null,"vazia"]
[null,{"$f":"IFERROR(IF(EDATE($C$8,183)>$C$9,\"\",IF(EDATE($C$8,183)>DATE(2099,12,1),\"\",EDATE($C$8,183))),\"\")","v":""},{"$f":"IFERROR(IF(B204=\"\",\"\",VLOOKUP(B204,Índices!$A:$H,5,0)),\"\")","v":""},{"$f":"IFERROR(IF(B204=\"\",\"\",VLOOKUP(B204,Índices!$A:$H,6,0)),\"\")","v":""},{"$f":"IFERROR(IF(B204=\"\",\"\",$C$10*VLOOKUP(B204,Índices!$A:$H,7,0)/VLOOKUP(EDATE($C$8,-1),Índices!$A:$H,7,0)),\"\")","v":""},{"$f":"IFERROR(IF(B204=\"\",\"\",E204*(VLOOKUP(B204,Índices!$A:$H,8,0)-VLOOKUP(EDATE($C$8,-1),Índices!$A:$H,8,0))),\"\")","v":""},null,"vazia"]
[null,{"$f":"IFERROR(IF(EDATE($C$8,184)>$C$9,\"\",IF(EDATE($C$8,184)>DATE(2099,12,1),\"\",EDATE($C$8,184))),\"\")","v":""},{"$f":"IFERROR(IF(B205=\"\",\"\",VLOOKUP(B205,Índices!$A:$H,5,0)),\"\")","v":""},{"$f":"IFERROR(IF(B205=\"\",\"\",VLOOKUP(B205,Índices!$A:$H,6,0)),\"\")","v":""},{"$f":"IFERROR(IF(B205=\"\",\"\",$C$10*VLOOKUP(B205,Índices!$A:$H,7,0)/VLOOKUP(EDATE($C$8,-1),Índices!$A:$H,7,0)),\"\")","v":""},{"$f":"IFERROR(IF(B205=\"\",\"\",E205*(VLOOKUP(B205,Índices!$A:$H,8,0)-VLOOKUP(EDATE($C$8,-1),Índices!$A:$H,8,0))),\"\")","v":""},null,"vazia"]
[null,{"$f":"IFERROR(IF(EDATE($C$8,185)>$C$9,\"\",IF(EDATE($C$8,185)>DATE(2099,12,1),\"\",EDATE($C$8,185))),\"\")","v":""},{"$f":"IFERROR(IF(B206=\"\",\"\",VLOOKUP(B206,Índices!$A:$H,5,0)),\"\")","v":""},{"$f":"IFERROR(IF(B206=\"\",\"\",VLOOKUP(B206,Índices!$A:$H,6,0)),\"\")","v":""},{"$f":"IFERROR(IF(B206=\"\",\"\",$C$10*VLOOKUP(B206,Índices!$A:$H,7,0)/VLOOKUP(EDATE($C$8,-1),Índices!$A:$H,7,0)),\"\")","v":""},{"$f":"IFERROR(IF(B206=\"\",\"\",E206*(VLOOKUP(B206,Índices!$A:$H,8,0)-VLOOKUP(EDATE($C$8,-1),Índices!$A:$H,8,0))),\"\")","v":""},null,"vazia"]
[null,{"$f":"IFERROR(IF(EDATE($C$8,186)>$C$9,\"\",IF(EDATE($C$8,186)>DATE(2099,12,1),\"\",EDATE($C$8,186))),\"\")","v":""},{"$f":"IFERROR(IF(B207=\"\",\"\",VLOOKUP(B207,Índices!$A:$H,5,0)),\"\")","v":""},{"$f":"IFERROR(IF(B207=\"\",\"\",VLOOKUP(B207,Índices!$A:$H,6,0)),\"\")","v":""},{"$f":"IFERROR(IF(B207=\"\",\"\",$C$10*VLOOKUP(B207,Índices!$A:$H,7,0)/VLOOKUP(EDATE($C$8,-1),Índices!$A:$H,7,0)),\"\")","v":""},{"$f":"IFERROR(IF(B207=\"\",\"\",E207*(VLOOKUP(B207,Índices!$A:$H,8,0)-VLOOKUP(EDATE($C$8,-1),Índices!$A:$H,8,0))),\"\")","v":""},null,"vazia"]
[null,{"$f":"IFERROR(IF(EDATE($C$8,187)>$C$9,\"\",IF(EDATE($C$8,187)>DATE(2099,12,1),\"\",EDATE($C$8,187))),\"\")","v":""},{"$f":"IFERROR(IF(B208=\"\",\"\",VLOOKUP(B208,Índices!$A:$H,5,0)),\"\")","v":""},{"$f":"IFERROR(IF(B208=\"\",\"\",VLOOKUP(B208,Índices!$A:$H,6,0)),\"\")","v":""},{"$f":"IFERROR(IF(B208=\"\",\"\",$C$10*VLOOKUP(B208,Índices!$A:$H,7,0)/VLOOKUP(EDATE($C$8,-1),Índices!$A:$H,7,0)),\"\")","v":""},{"$f":"IFERROR(IF(B208=\"\",\"\",E208*(VLOOKUP(B208,Índices!$A:$H,8,0)-VLOOKUP(EDATE($C$8,-1),Índices!$A:$H,8,0))),\"\")","v":""},null,"vazia"]
[null,{"$f":"IFERROR(IF(EDATE($C$8,188)>$C$9,\"\",IF(EDATE($C$8,188)>DATE(2099,12,1),\"\",EDATE($C$8,188))),\"\")","v":""},{"$f":"IFERROR(IF(B209=\"\",\"\",VLOOKUP(B209,Índices!$A:$H,5,0)),\"\")","v":""},{"$f":"IFERROR(IF(B209=\"\",\"\",VLOOKUP(B209,Índices!$A:$H,6,0)),\"\")","v":""},{"$f":"IFERROR(IF(B209=\"\",\"\",$C$10*VLOOKUP(B209,Índices!$A:$H,7,0)/VLOOKUP(EDATE($C$8,-1),Índices!$A:$H,7,0)),\"\")","v":""},{"$f":"IFERROR(IF(B209=\"\",\"\",E209*(VLOOKUP(B209,Índices!$A:$H,8,0)-VLOOKUP(EDATE($C$8,-1),Índices!$A:$H,8,0))),\"\")","v":""},null,"vazia"]
[null,{"$f":"IFERROR(IF(EDATE($C$8,189)>$C$9,\"\",IF(EDATE($C$8,189)>DATE(2099,12,1),\"\",EDATE($C$8,189))),\"\")","v":""},{"$f":"IFERROR(IF(B210=\"\",\"\",VLOOKUP(B210,Índices!$A:$H,5,0)),\"\")","v":""},{"$f":"IFERROR(IF(B210=\"\",\"\",VLOOKUP(B210,Índices!$A:$H,6,0)),\"\")","v":""},{"$f":"IFERROR(IF(B210=\"\",\"\",$C$10*VLOOKUP(B210,Índices!$A:$H,7,0)/VLOOKUP(EDATE($C$8,-1),Índices!$A:$H,7,0)),\"\")","v":""},{"$f":"IFERROR(IF(B210=\"\",\"\",E210*(VLOOKUP(B210,Índices!$A:$H,8,0)-VLOOKUP(EDATE($C$8,-1),Índices!$A:$H,8,0))),\"\")","v":""},null,"vazia"]
[null,{"$f":"IFERROR(IF(EDATE($C$8,190)>$C$9,\"\",IF(EDATE($C$8,190)>DATE(2099,12,1),\"\",EDATE($C$8,190))),\"\")","v":""},{"$f":"IFERROR(IF(B211=\"\",\"\",VLOOKUP(B211,Índices!$A:$H,5,0)),\"\")","v":""},{"$f":"IFERROR(IF(B211=\"\",\"\",VLOOKUP(B211,Índices!$A:$H,6,0)),\"\")","v":""},{"$f":"IFERROR(IF(B211=\"\",\"\",$C$10*VLOOKUP(B211,Índices!$A:$H,7,0)/VLOOKUP(EDATE($C$8,-1),Índices!$A:$H,7,0)),\"\")","v":""},{"$f":"IFERROR(IF(B211=\"\",\"\",E211*(VLOOKUP(B211,Índices!$A:$H,8,0)-VLOOKUP(EDATE($C$8,-1),Índices!$A:$H,8,0))),\"\")","v":""},null,"vazia"]
[null,{"$f":"IFERROR(IF(EDATE($C$8,191)>$C$9,\"\",IF(EDATE($C$8,191)>DATE(2099,12,1),\"\",EDATE($C$8,191))),\"\")","v":""},{"$f":"IFERROR(IF(B212=\"\",\"\",VLOOKUP(B212,Índices!$A:$H,5,0)),\"\")","v":""},{"$f":"IFERROR(IF(B212=\"\",\"\",VLOOKUP(B212,Índices!$A:$H,6,0)),\"\")","v":""},{"$f":"IFERROR(IF(B212=\"\",\"\",$C$10*VLOOKUP(B212,Índices!$A:$H,7,0)/VLOOKUP(EDATE($C$8,-1),Índices!$A:$H,7,0)),\"\")","v":""},{"$f":"IFERROR(IF(B212=\"\",\"\",E212*(VLOOKUP(B212,Índices!$A:$H,8,0)-VLOOKUP(EDATE($C$8,-1),Índices!$A:$H,8,0))),\"\")","v":""},null,"vazia"]
[null,{"$f":"IFERROR(IF(EDATE($C$8,192)>$C$9,\"\",IF(EDATE($C$8,192)>DATE(2099,12,1),\"\",EDATE($C$8,192))),\"\")","v":""},{"$f":"IFERROR(IF(B213=\"\",\"\",VLOOKUP(B213,Índices!$A:$H,5,0)),\"\")","v":""},{"$f":"IFERROR(IF(B213=\"\",\"\",VLOOKUP(B213,Índices!$A:$H,6,0)),\"\")","v":""},{"$f":"IFERROR(IF(B213=\"\",\"\",$C$10*VLOOKUP(B213,Índices!$A:$H,7,0)/VLOOKUP(EDATE($C$8,-1),Índices!$A:$H,7,0)),\"\")","v":""},{"$f":"IFERROR(IF(B213=\"\",\"\",E213*(VLOOKUP(B213,Índices!$A:$H,8,0)-VLOOKUP(EDATE($C$8,-1),Índices!$A:$H,8,0))),\"\")","v":""},null,"vazia"]
[null,{"$f":"IFERROR(IF(EDATE($C$8,193)>$C$9,\"\",IF(EDATE($C$8,193)>DATE(2099,12,1),\"\",EDATE($C$8,193))),\"\")","v":""},{"$f":"IFERROR(IF(B214=\"\",\"\",VLOOKUP(B214,Índices!$A:$H,5,0)),\"\")","v":""},{"$f":"IFERROR(IF(B214=\"\",\"\",VLOOKUP(B214,Índices!$A:$H,6,0)),\"\")","v":""},{"$f":"IFERROR(IF(B214=\"\",\"\",$C$10*VLOOKUP(B214,Índices!$A:$H,7,0)/VLOOKUP(EDATE($C$8,-1),Índices!$A:$H,7,0)),\"\")","v":""},{"$f":"IFERROR(IF(B214=\"\",\"\",E214*(VLOOKUP(B214,Índices!$A:$H,8,0)-VLOOKUP(EDATE($C$8,-1),Índices!$A:$H,8,0))),\"\")","v":""},null,{"$f":"IF(B214=\"\",\"vazia\",\"1\")","v":"vazia"}]
[null,{"$f":"IFERROR(IF(EDATE($C$8,194)>$C$9,\"\",IF(EDATE($C$8,194)>DATE(2099,12,1),\"\",EDATE($C$8,194))),\"\")","v":""},{"$f":"IFERROR(IF(B215=\"\",\"\",VLOOKUP(B215,Índices!$A:$H,5,0)),\"\")","v":""},{"$f":"IFERROR(IF(B215=\"\",\"\",VLOOKUP(B215,Índices!$A:$H,6,0)),\"\")","v":""},{"$f":"IFERROR(IF(B215=\"\",\"\",$C$10*VLOOKUP(B215,Índices!$A:$H,7,0)/VLOOKUP(EDATE($C$8,-1),Índices!$A:$H,7,0)),\"\")","v":""},{"$f":"IFERROR(IF(B215=\"\",\"\",E215*(VLOOKUP(B215,Índices!$A:$H,8,0)-VLOOKUP(EDATE($C$8,-1),Índices!$A:$H,8,0))),\"\")","v":""},null,"vazia"]
[null,{"$f":"IFERROR(IF(EDATE($C$8,195)>$C$9,\"\",IF(EDATE($C$8,195)>DATE(2099,12,1),\"\",EDATE($C$8,195))),\"\")","v":""},{"$f":"IFERROR(IF(B216=\"\",\"\",VLOOKUP(B216,Índices!$A:$H,5,0)),\"\")","v":""},{"$f":"IFERROR(IF(B216=\"\",\"\",VLOOKUP(B216,Índices!$A:$H,6,0)),\"\")","v":""},{"$f":"IFERROR(IF(B216=\"\",\"\",$C$10*VLOOKUP(B216,Índices!$A:$H,7,0)/VLOOKUP(EDATE($C$8,-1),Índices!$A:$H,7,0)),\"\")","v":""},{"$f":"IFERROR(IF(B216=\"\",\"\",E216*(VLOOKUP(B216,Índices!$A:$H,8,0)-VLOOKUP(EDATE($C$8,-1),Índices!$A:$H,8,0))),\"\")","v":""},null,"vazia"]
[null,{"$f":"IFERROR(IF(EDATE($C$8,196)>$C$9,\"\",IF(EDATE($C$8,196)>DATE(2099,12,1),\"\",EDATE($C$8,196))),\"\")","v":""},{"$f":"IFERROR(IF(B217=\"\",\"\",VLOOKUP(B217,Índices!$A:$H,5,0)),\"\")","v":""},{"$f":"IFERROR(IF(B217=\"\",\"\",VLOOKUP(B217,Índices!$A:$H,6,0)),\"\")","v":""},{"$f":"IFERROR(IF(B217=\"\",\"\",$C$10*VLOOKUP(B217,Índices!$A:$H,7,0)/VLOOKUP(EDATE($C$8,-1),Índices!$A:$H,7,0)),\"\")","v":""},{"$f":"IFERROR(IF(B217=\"\",\"\",E217*(VLOOKUP(B217,Índices!$A:$H,8,0)-VLOOKUP(EDATE($C$8,-1),Índices!$A:$H,8,0))),\"\")","v":""},null,"vazia"]
[null,{"$f":"IFERROR(IF(EDATE($C$8,197)>$C$9,\"\",IF(EDATE($C$8,197)>DATE(2099,12,1),\"\",EDATE($C$8,197))),\"\")","v":""},{"$f":"IFERROR(IF(B218=\"\",\"\",VLOOKUP(B218,Índices!$A:$H,5,0)),\"\")","v":""},{"$f":"IFERROR(IF(B218=\"\",\"\",VLOOKUP(B218,Índices!$A:$H,6,0)),\"\")","v":""},{"$f":"IFERROR(IF(B218=\"\",\"\",$C$10*VLOOKUP(B218,Índices!$A:$H,7,0)/VLOOKUP(EDATE($C$8,-1),Índices!$A:$H,7,0)),\"\")","v":""},{"$f":"IFERROR(IF(B218=\"\",\"\",E218*(VLOOKUP(B218,Índices!$A:$H,8,0)-VLOOKUP(EDATE($C$8,-1),Índices!$A:$H,8,0))),\"\")","v":""},null,"vazia"]
[null,{"$f":"IFERROR(IF(EDATE($C$8,198)>$C$9,\"\",IF(EDATE($C$8,198)>DATE(2099,12,1),\"\",EDATE($C$8,198))),\"\")","v":""},{"$f":"IFERROR(IF(B219=\"\",\"\",VLOOKUP(B219,Índices!$A:$H,5,0)),\"\")","v":""},{"$f":"IFERROR(IF(B219=\"\",\"\",VLOOKUP(B219,Índices!$A:$H,6,0)),\"\")","v":""},{"$f":"IFERROR(IF(B219=\"\",\"\",$C$10*VLOOKUP(B219,Índices!$A:$H,7,0)/VLOOKUP(EDATE($C$8,-1),Índices!$A:$H,7,0)),\"\")","v":""},{"$f":"IFERROR(IF(B219=\"\",\"\",E219*(VLOOKUP(B219,Índices!$A:$H,8,0)-VLOOKUP(EDATE($C$8,-1),Índices!$A:$H,8,0))),\"\")","v":""},null,"vazia"]
[null,{"$f":"IFERROR(IF(EDATE($C$8,199)>$C$9,\"\",IF(EDATE($C$8,199)>DATE(2099,12,1),\"\",EDATE($C$8,199))),\"\")","v":""},{"$f":"IFERROR(IF(B220=\"\",\"\",VLOOKUP(B220,Índices!$A:$H,5,0)),\"\")","v":""},{"$f":"IFERROR(IF(B220=\"\",\"\",VLOOKUP(B220,Índices!$A:$H,6,0)),\"\")","v":""},{"$f":"IFERROR(IF(B220=\"\",\"\",$C$10*VLOOKUP(B220,Índices!$A:$H,7,0)/VLOOKUP(EDATE($C$8,-1),Índices!$A:$H,7,0)),\"\")","v":""},{"$f":"IFERROR(IF(B220=\"\",\"\",E220*(VLOOKUP(B220,Índices!$A:$H,8,0)-VLOOKUP(EDATE($C$8,-1),Índices!$A:$H,8,0))),\"\")","v":""},null,"vazia"]
[null,{"$f":"IFERROR(IF(EDATE($C$8,200)>$C$9,\"\",IF(EDATE($C$8,200)>DATE(2099,12,1),\"\",EDATE($C$8,200))),\"\")","v":""},{"$f":"IFERROR(IF(B221=\"\",\"\",VLOOKUP(B221,Índices!$A:$H,5,0)),\"\")","v":""},{"$f":"IFERROR(IF(B221=\"\",\"\",VLOOKUP(B221,Índices!$A:$H,6,0)),\"\")","v":""},{"$f":"IFERROR(IF(B221=\"\",\"\",$C$10*VLOOKUP(B221,Índices!$A:$H,7,0)/VLOOKUP(EDATE($C$8,-1),Índices!$A:$H,7,0)),\"\")","v":""},{"$f":"IFERROR(IF(B221=\"\",\"\",E221*(VLOOKUP(B221,Índices!$A:$H,8,0)-VLOOKUP(EDATE($C$8,-1),Índices!$A:$H,8,0))),\"\")","v":""},null,"vazia"]
[null,{"$f":"IFERROR(IF(EDATE($C$8,201)>$C$9,\"\",IF(EDATE($C$8,201)>DATE(2099,12,1),\"\",EDATE($C$8,201))),\"\")","v":""},{"$f":"IFERROR(IF(B222=\"\",\"\",VLOOKUP(B222,Índices!$A:$H,5,0)),\"\")","v":""},{"$f":"IFERROR(IF(B222=\"\",\"\",VLOOKUP(B222,Índices!$A:$H,6,0)),\"\")","v":""},{"$f":"IFERROR(IF(B222=\"\",\"\",$C$10*VLOOKUP(B222,Índices!$A:$H,7,0)/VLOOKUP(EDATE($C$8,-1),Índices!$A:$H,7,0)),\"\")","v":""},{"$f":"IFERROR(IF(B222=\"\",\"\",E222*(VLOOKUP(B222,Índices!$A:$H,8,0)-VLOOKUP(EDATE($C$8,-1),Índices!$A:$H,8,0))),\"\")","v":""},null,"vazia"]
[null,{"$f":"IFERROR(IF(EDATE($C$8,202)>$C$9,\"\",IF(EDATE($C$8,202)>DATE(2099,12,1),\"\",EDATE($C$8,202))),\"\")","v":""},{"$f":"IFERROR(IF(B223=\"\",\"\",VLOOKUP(B223,Índices!$A:$H,5,0)),\"\")","v":""},{"$f":"IFERROR(IF(B223=\"\",\"\",VLOOKUP(B223,Índices!$A:$H,6,0)),\"\")","v":""},{"$f":"IFERROR(IF(B223=\"\",\"\",$C$10*VLOOKUP(B223,Índices!$A:$H,7,0)/VLOOKUP(EDATE($C$8,-1),Índices!$A:$H,7,0)),\"\")","v":""},{"$f":"IFERROR(IF(B223=\"\",\"\",E223*(VLOOKUP(B223,Índices!$A:$H,8,0)-VLOOKUP(EDATE($C$8,-1),Índices!$A:$H,8,0))),\"\")","v":""},null,"vazia"]
[null,{"$f":"IFERROR(IF(EDATE($C$8,203)>$C$9,\"\",IF(EDATE($C$8,203)>DATE(2099,12,1),\"\",EDATE($C$8,203))),\"\")","v":""},{"$f":"IFERROR(IF(B224=\"\",\"\",VLOOKUP(B224,Índices!$A:$H,5,0)),\"\")","v":""},{"$f":"IFERROR(IF(B224=\"\",\"\",VLOOKUP(B224,Índices!$A:$H,6,0)),\"\")","v":""},{"$f":"IFERROR(IF(B224=\"\",\"\",$C$10*VLOOKUP(B224,Índices!$A:$H,7,0)/VLOOKUP(EDATE($C$8,-1),Índices!$A:$H,7,0)),\"\")","v":""},{"$f":"IFERROR(IF(B224=\"\",\"\",E224*(VLOOKUP(B224,Índices!$A:$H,8,0)-VLOOKUP(EDATE($C$8,-1),Índices!$A:$H,8,0))),\"\")","v":""},null,"vazia"]
[null,{"$f":"IFERROR(IF(EDATE($C$8,204)>$C$9,\"\",IF(EDATE($C$8,204)>DATE(2099,12,1),\"\",EDATE($C$8,204))),\"\")","v":""},{"$f":"IFERROR(IF(B225=\"\",\"\",VLOOKUP(B225,Índices!$A:$H,5,0)),\"\")","v":""},{"$f":"IFERROR(IF(B225=\"\",\"\",VLOOKUP(B225,Índices!$A:$H,6,0)),\"\")","v":""},{"$f":"IFERROR(IF(B225=\"\",\"\",$C$10*VLOOKUP(B225,Índices!$A:$H,7,0)/VLOOKUP(EDATE($C$8,-1),Índices!$A:$H,7,0)),\"\")","v":""},{"$f":"IFERROR(IF(B225=\"\",\"\",E225*(VLOOKUP(B225,Índices!$A:$H,8,0)-VLOOKUP(EDATE($C$8,-1),Índices!$A:$H,8,0))),\"\")","v":""},null,"vazia"]
[null,{"$f":"IFERROR(IF(EDATE($C$8,205)>$C$9,\"\",IF(EDATE($C$8,205)>DATE(2099,12,1),\"\",EDATE($C$8,205))),\"\")","v":""},{"$f":"IFERROR(IF(B226=\"\",\"\",VLOOKUP(B226,Índices!$A:$H,5,0)),\"\")","v":""},{"$f":"IFERROR(IF(B226=\"\",\"\",VLOOKUP(B226,Índices!$A:$H,6,0)),\"\")","v":""},{"$f":"IFERROR(IF(B226=\"\",\"\",$C$10*VLOOKUP(B226,Índices!$A:$H,7,0)/VLOOKUP(EDATE($C$8,-1),Índices!$A:$H,7,0)),\"\")","v":""},{"$f":"IFERROR(IF(B226=\"\",\"\",E226*(VLOOKUP(B226,Índices!$A:$H,8,0)-VLOOKUP(EDATE($C$8,-1),Índices!$A:$H,8,0))),\"\")","v":""},null,"vazia"]
[null,{"$f":"IFERROR(IF(EDATE($C$8,206)>$C$9,\"\",IF(EDATE($C$8,206)>DATE(2099,12,1),\"\",EDATE($C$8,206))),\"\")","v":""},{"$f":"IFERROR(IF(B227=\"\",\"\",VLOOKUP(B227,Índices!$A:$H,5,0)),\"\")","v":""},{"$f":"IFERROR(IF(B227=\"\",\"\",VLOOKUP(B227,Índices!$A:$H,6,0)),\"\")","v":""},{"$f":"IFERROR(IF(B227=\"\",\"\",$C$10*VLOOKUP(B227,Índices!$A:$H,7,0)/VLOOKUP(EDATE($C$8,-1),Índices!$A:$H,7,0)),\"\")","v":""},{"$f":"IFERROR(IF(B227=\"\",\"\",E227*(VLOOKUP(B227,Índices!$A:$H,8,0)-VLOOKUP(EDATE($C$8,-1),Índices!$A:$H,8,0))),\"\")","v":""},null,"vazia"]
[null,{"$f":"IFERROR(IF(EDATE($C$8,207)>$C$9,\"\",IF(EDATE($C$8,207)>DATE(2099,12,1),\"\",EDATE($C$8,207))),\"\")","v":""},{"$f":"IFERROR(IF(B228=\"\",\"\",VLOOKUP(B228,Índices!$A:$H,5,0)),\"\")","v":""},{"$f":"IFERROR(IF(B228=\"\",\"\",VLOOKUP(B228,Índices!$A:$H,6,0)),\"\")","v":""},{"$f":"IFERROR(IF(B228=\"\",\"\",$C$10*VLOOKUP(B228,Índices!$A:$H,7,0)/VLOOKUP(EDATE($C$8,-1),Índices!$A:$H,7,0)),\"\")","v":""},{"$f":"IFERROR(IF(B228=\"\",\"\",E228*(VLOOKUP(B228,Índices!$A:$H,8,0)-VLOOKUP(EDATE($C$8,-1),Índices!$A:$H,8,0))),\"\")","v":""},null,"vazia"]
[null,{"$f":"IFERROR(IF(EDATE($C$8,208)>$C$9,\"\",IF(EDATE($C$8,208)>DATE(2099,12,1),\"\",EDATE($C$8,208))),\"\")","v":""},{"$f":"IFERROR(IF(B229=\"\",\"\",VLOOKUP(B229,Índices!$A:$H,5,0)),\"\")","v":""},{"$f":"IFERROR(IF(B229=\"\",\"\",VLOOKUP(B229,Índices!$A:$H,6,0)),\"\")","v":""},{"$f":"IFERROR(IF(B229=\"\",\"\",$C$10*VLOOKUP(B229,Índices!$A:$H,7,0)/VLOOKUP(EDATE($C$8,-1),Índices!$A:$H,7,0)),\"\")","v":""},{"$f":"IFERROR(IF(B229=\"\",\"\",E229*(VLOOKUP(B229,Índices!$A:$H,8,0)-VLOOKUP(EDATE($C$8,-1),Índices!$A:$H,8,0))),\"\")","v":""},null,"vazia"]
[null,{"$f":"IFERROR(IF(EDATE($C$8,209)>$C$9,\"\",IF(EDATE($C$8,209)>DATE(2099,12,1),\"\",EDATE($C$8,209))),\"\")","v":""},{"$f":"IFERROR(IF(B230=\"\",\"\",VLOOKUP(B230,Índices!$A:$H,5,0)),\"\")","v":""},{"$f":"IFERROR(IF(B230=\"\",\"\",VLOOKUP(B230,Índices!$A:$H,6,0)),\"\")","v":""},{"$f":"IFERROR(IF(B230=\"\",\"\",$C$10*VLOOKUP(B230,Índices!$A:$H,7,0)/VLOOKUP(EDATE($C$8,-1),Índices!$A:$H,7,0)),\"\")","v":""},{"$f":"IFERROR(IF(B230=\"\",\"\",E230*(VLOOKUP(B230,Índices!$A:$H,8,0)-VLOOKUP(EDATE($C$8,-1),Índices!$A:$H,8,0))),\"\")","v":""},null,"vazia"]
[null,{"$f":"IFERROR(IF(EDATE($C$8,210)>$C$9,\"\",IF(EDATE($C$8,210)>DATE(2099,12,1),\"\",EDATE($C$8,210))),\"\")","v":""},{"$f":"IFERROR(IF(B231=\"\",\"\",VLOOKUP(B231,Índices!$A:$H,5,0)),\"\")","v":""},{"$f":"IFERROR(IF(B231=\"\",\"\",VLOOKUP(B231,Índices!$A:$H,6,0)),\"\")","v":""},{"$f":"IFERROR(IF(B231=\"\",\"\",$C$10*VLOOKUP(B231,Índices!$A:$H,7,0)/VLOOKUP(EDATE($C$8,-1),Índices!$A:$H,7,0)),\"\")","v":""},{"$f":"IFERROR(IF(B231=\"\",\"\",E231*(VLOOKUP(B231,Índices!$A:$H,8,0)-VLOOKUP(EDATE($C$8,-1),Índices!$A:$H,8,0))),\"\")","v":""},null,"vazia"]
[null,{"$f":"IFERROR(IF(EDATE($C$8,211)>$C$9,\"\",IF(EDATE($C$8,211)>DATE(2099,12,1),\"\",EDATE($C$8,211))),\"\")","v":""},{"$f":"IFERROR(IF(B232=\"\",\"\",VLOOKUP(B232,Índices!$A:$H,5,0)),\"\")","v":""},{"$f":"IFERROR(IF(B232=\"\",\"\",VLOOKUP(B232,Índices!$A:$H,6,0)),\"\")","v":""},{"$f":"IFERROR(IF(B232=\"\",\"\",$C$10*VLOOKUP(B232,Índices!$A:$H,7,0)/VLOOKUP(EDATE($C$8,-1),Índices!$A:$H,7,0)),\"\")","v":""},{"$f":"IFERROR(IF(B232=\"\",\"\",E232*(VLOOKUP(B232,Índices!$A:$H,8,0)-VLOOKUP(EDATE($C$8,-1),Índices!$A:$H,8,0))),\"\")","v":""},null,"vazia"]
[null,{"$f":"IFERROR(IF(EDATE($C$8,212)>$C$9,\"\",IF(EDATE($C$8,212)>DATE(2099,12,1),\"\",EDATE($C$8,212))),\"\")","v":""},{"$f":"IFERROR(IF(B233=\"\",\"\",VLOOKUP(B233,Índices!$A:$H,5,0)),\"\")","v":""},{"$f":"IFERROR(IF(B233=\"\",\"\",VLOOKUP(B233,Índices!$A:$H,6,0)),\"\")","v":""},{"$f":"IFERROR(IF(B233=\"\",\"\",$C$10*VLOOKUP(B233,Índices!$A:$H,7,0)/VLOOKUP(EDATE($C$8,-1),Índices!$A:$H,7,0)),\"\")","v":""},{"$f":"IFERROR(IF(B233=\"\",\"\",E233*(VLOOKUP(B233,Índices!$A:$H,8,0)-VLOOKUP(EDATE($C$8,-1),Índices!$A:$H,8,0))),\"\")","v":""},null,"vazia"]
[null,{"$f":"IFERROR(IF(EDATE($C$8,213)>$C$9,\"\",IF(EDATE($C$8,213)>DATE(2099,12,1),\"\",EDATE($C$8,213))),\"\")","v":""},{"$f":"IFERROR(IF(B234=\"\",\"\",VLOOKUP(B234,Índices!$A:$H,5,0)),\"\")","v":""},{"$f":"IFERROR(IF(B234=\"\",\"\",VLOOKUP(B234,Índices!$A:$H,6,0)),\"\")","v":""},{"$f":"IFERROR(IF(B234=\"\",\"\",$C$10*VLOOKUP(B234,Índices!$A:$H,7,0)/VLOOKUP(EDATE($C$8,-1),Índices!$A:$H,7,0)),\"\")","v":""},{"$f":"IFERROR(IF(B234=\"\",\"\",E234*(VLOOKUP(B234,Índices!$A:$H,8,0)-VLOOKUP(EDATE($C$8,-1),Índices!$A:$H,8,0))),\"\")","v":""},null,"vazia"]
[null,{"$f":"IFERROR(IF(EDATE($C$8,214)>$C$9,\"\",IF(EDATE($C$8,214)>DATE(2099,12,1),\"\",EDATE($C$8,214))),\"\")","v":""},{"$f":"IFERROR(IF(B235=\"\",\"\",VLOOKUP(B235,Índices!$A:$H,5,0)),\"\")","v":""},{"$f":"IFERROR(IF(B235=\"\",\"\",VLOOKUP(B235,Índices!$A:$H,6,0)),\"\")","v":""},{"$f":"IFERROR(IF(B235=\"\",\"\",$C$10*VLOOKUP(B235,Índices!$A:$H,7,0)/VLOOKUP(EDATE($C$8,-1),Índices!$A:$H,7,0)),\"\")","v":""},{"$f":"IFERROR(IF(B235=\"\",\"\",E235*(VLOOKUP(B235,Índices!$A:$H,8,0)-VLOOKUP(EDATE($C$8,-1),Índices!$A:$H,8,0))),\"\")","v":""},null,"vazia"]
[null,{"$f":"IFERROR(IF(EDATE($C$8,215)>$C$9,\"\",IF(EDATE($C$8,215)>DATE(2099,12,1),\"\",EDATE($C$8,215))),\"\")","v":""},{"$f":"IFERROR(IF(B236=\"\",\"\",VLOOKUP(B236,Índices!$A:$H,5,0)),\"\")","v":""},{"$f":"IFERROR(IF(B236=\"\",\"\",VLOOKUP(B236,Índices!$A:$H,6,0)),\"\")","v":""},{"$f":"IFERROR(IF(B236=\"\",\"\",$C$10*VLOOKUP(B236,Índices!$A:$H,7,0)/VLOOKUP(EDATE($C$8,-1),Índices!$A:$H,7,0)),\"\")","v":""},{"$f":"IFERROR(IF(B236=\"\",\"\",E236*(VLOOKUP(B236,Índices!$A:$H,8,0)-VLOOKUP(EDATE($C$8,-1),Índices!$A:$H,8,0))),\"\")","v":""},null,"vazia"]
[null,{"$f":"IFERROR(IF(EDATE($C$8,216)>$C$9,\"\",IF(EDATE($C$8,216)>DATE(2099,12,1),\"\",EDATE($C$8,216))),\"\")","v":""},{"$f":"IFERROR(IF(B237=\"\",\"\",VLOOKUP(B237,Índices!$A:$H,5,0)),\"\")","v":""},{"$f":"IFERROR(IF(B237=\"\",\"\",VLOOKUP(B237,Índices!$A:$H,6,0)),\"\")","v":""},{"$f":"IFERROR(IF(B237=\"\",\"\",$C$10*VLOOKUP(B237,Índices!$A:$H,7,0)/VLOOKUP(EDATE($C$8,-1),Índices!$A:$H,7,0)),\"\")","v":""},{"$f":"IFERROR(IF(B237=\"\",\"\",E237*(VLOOKUP(B237,Índices!$A:$H,8,0)-VLOOKUP(EDATE($C$8,-1),Índices!$A:$H,8,0))),\"\")","v":""},null,"vazia"]
[null,{"$f":"IFERROR(IF(EDATE($C$8,217)>$C$9,\"\",IF(EDATE($C$8,217)>DATE(2099,12,1),\"\",EDATE($C$8,217))),\"\")","v":""},{"$f":"IFERROR(IF(B238=\"\",\"\",VLOOKUP(B238,Índices!$A:$H,5,0)),\"\")","v":""},{"$f":"IFERROR(IF(B238=\"\",\"\",VLOOKUP(B238,Índices!$A:$H,6,0)),\"\")","v":""},{"$f":"IFERROR(IF(B238=\"\",\"\",$C$10*VLOOKUP(B238,Índices!$A:$H,7,0)/VLOOKUP(EDATE($C$8,-1),Índices!$A:$H,7,0)),\"\")","v":""},{"$f":"IFERROR(IF(B238=\"\",\"\",E238*(VLOOKUP(B238,Índices!$A:$H,8,0)-VLOOKUP(EDATE($C$8,-1),Índices!$A:$H,8,0))),\"\")","v":""},null,"vazia"]
[null,{"$f":"IFERROR(IF(EDATE($C$8,218)>$C$9,\"\",IF(EDATE($C$8,218)>DATE(2099,12,1),\"\",EDATE($C$8,218))),\"\")","v":""},{"$f":"IFERROR(IF(B239=\"\",\"\",VLOOKUP(B239,Índices!$A:$H,5,0)),\"\")","v":""},{"$f":"IFERROR(IF(B239=\"\",\"\",VLOOKUP(B239,Índices!$A:$H,6,0)),\"\")","v":""},{"$f":"IFERROR(IF(B239=\"\",\"\",$C$10*VLOOKUP(B239,Índices!$A:$H,7,0)/VLOOKUP(EDATE($C$8,-1),Índices!$A:$H,7,0)),\"\")","v":""},{"$f":"IFERROR(IF(B239=\"\",\"\",E239*(VLOOKUP(B239,Índices!$A:$H,8,0)-VLOOKUP(EDATE($C$8,-1),Índices!$A:$H,8,0))),\"\")","v":""},null,"vazia"]
[null,{"$f":"IFERROR(IF(EDATE($C$8,219)>$C$9,\"\",IF(EDATE($C$8,219)>DATE(2099,12,1),\"\",EDATE($C$8,219))),\"\")","v":""},{"$f":"IFERROR(IF(B240=\"\",\"\",VLOOKUP(B240,Índices!$A:$H,5,0)),\"\")","v":""},{"$f":"IFERROR(IF(B240=\"\",\"\",VLOOKUP(B240,Índices!$A:$H,6,0)),\"\")","v":""},{"$f":"IFERROR(IF(B240=\"\",\"\",$C$10*VLOOKUP(B240,Índices!$A:$H,7,0)/VLOOKUP(EDATE($C$8,-1),Índices!$A:$H,7,0)),\"\")","v":""},{"$f":"IFERROR(IF(B240=\"\",\"\",E240*(VLOOKUP(B240,Índices!$A:$H,8,0)-VLOOKUP(EDATE($C$8,-1),Índices!$A:$H,8,0))),\"\")","v":""},null,"vazia"]
[null,{"$f":"IFERROR(IF(EDATE($C$8,220)>$C$9,\"\",IF(EDATE($C$8,220)>DATE(2099,12,1),\"\",EDATE($C$8,220))),\"\")","v":""},{"$f":"IFERROR(IF(B241=\"\",\"\",VLOOKUP(B241,Índices!$A:$H,5,0)),\"\")","v":""},{"$f":"IFERROR(IF(B241=\"\",\"\",VLOOKUP(B241,Índices!$A:$H,6,0)),\"\")","v":""},{"$f":"IFERROR(IF(B241=\"\",\"\",$C$10*VLOOKUP(B241,Índices!$A:$H,7,0)/VLOOKUP(EDATE($C$8,-1),Índices!$A:$H,7,0)),\"\")","v":""},{"$f":"IFERROR(IF(B241=\"\",\"\",E241*(VLOOKUP(B241,Índices!$A:$H,8,0)-VLOOKUP(EDATE($C$8,-1),Índices!$A:$H,8,0))),\"\")","v":""},null,"vazia"]
[null,{"$f":"IFERROR(IF(EDATE($C$8,221)>$C$9,\"\",IF(EDATE($C$8,221)>DATE(2099,12,1),\"\",EDATE($C$8,221))),\"\")","v":""},{"$f":"IFERROR(IF(B242=\"\",\"\",VLOOKUP(B242,Índices!$A:$H,5,0)),\"\")","v":""},{"$f":"IFERROR(IF(B242=\"\",\"\",VLOOKUP(B242,Índices!$A:$H,6,0)),\"\")","v":""},{"$f":"IFERROR(IF(B242=\"\",\"\",$C$10*VLOOKUP(B242,Índices!$A:$H,7,0)/VLOOKUP(EDATE($C$8,-1),Índices!$A:$H,7,0)),\"\")","v":""},{"$f":"IFERROR(IF(B242=\"\",\"\",E242*(VLOOKUP(B242,Índices!$A:$H,8,0)-VLOOKUP(EDATE($C$8,-1),Índices!$A:$H,8,0))),\"\")","v":""},null,"vazia"]
[null,{"$f":"IFERROR(IF(EDATE($C$8,222)>$C$9,\"\",IF(EDATE($C$8,222)>DATE(2099,12,1),\"\",EDATE($C$8,222))),\"\")","v":""},{"$f":"IFERROR(IF(B243=\"\",\"\",VLOOKUP(B243,Índices!$A:$H,5,0)),\"\")","v":""},{"$f":"IFERROR(IF(B243=\"\",\"\",VLOOKUP(B243,Índices!$A:$H,6,0)),\"\")","v":""},{"$f":"IFERROR(IF(B243=\"\",\"\",$C$10*VLOOKUP(B243,Índices!$A:$H,7,0)/VLOOKUP(EDATE($C$8,-1),Índices!$A:$H,7,0)),\"\")","v":""},{"$f":"IFERROR(IF(B243=\"\",\"\",E243*(VLOOKUP(B243,Índices!$A:$H,8,0)-VLOOKUP(EDATE($C$8,-1),Índices!$A:$H,8,0))),\"\")","v":""},null,"vazia"]
[null,{"$f":"IFERROR(IF(EDATE($C$8,223)>$C$9,\"\",IF(EDATE($C$8,223)>DATE(2099,12,1),\"\",EDATE($C$8,223))),\"\")","v":""},{"$f":"IFERROR(IF(B244=\"\",\"\",VLOOKUP(B244,Índices!$A:$H,5,0)),\"\")","v":""},{"$f":"IFERROR(IF(B244=\"\",\"\",VLOOKUP(B244,Índices!$A:$H,6,0)),\"\")","v":""},{"$f":"IFERROR(IF(B244=\"\",\"\",$C$10*VLOOKUP(B244,Índices!$A:$H,7,0)/VLOOKUP(EDATE($C$8,-1),Índices!$A:$H,7,0)),\"\")","v":""},{"$f":"IFERROR(IF(B244=\"\",\"\",E244*(VLOOKUP(B244,Índices!$A:$H,8,0)-VLOOKUP(EDATE($C$8,-1),Índices!$A:$H,8,0))),\"\")","v":""},null,"vazia"]
[null,{"$f":"IFERROR(IF(EDATE($C$8,224)>$C$9,\"\",IF(EDATE($C$8,224)>DATE(2099,12,1),\"\",EDATE($C$8,224))),\"\")","v":""},{"$f":"IFERROR(IF(B245=\"\",\"\",VLOOKUP(B245,Índices!$A:$H,5,0)),\"\")","v":""},{"$f":"IFERROR(IF(B245=\"\",\"\",VLOOKUP(B245,Índices!$A:$H,6,0)),\"\")","v":""},{"$f":"IFERROR(IF(B245=\"\",\"\",$C$10*VLOOKUP(B245,Índices!$A:$H,7,0)/VLOOKUP(EDATE($C$8,-1),Índices!$A:$H,7,0)),\"\")","v":""},{"$f":"IFERROR(IF(B245=\"\",\"\",E245*(VLOOKUP(B245,Índices!$A:$H,8,0)-VLOOKUP(EDATE($C$8,-1),Índices!$A:$H,8,0))),\"\")","v":""},null,"vazia"]
[null,{"$f":"IFERROR(IF(EDATE($C$8,225)>$C$9,\"\",IF(EDATE($C$8,225)>DATE(2099,12,1),\"\",EDATE($C$8,225))),\"\")","v":""},{"$f":"IFERROR(IF(B246=\"\",\"\",VLOOKUP(B246,Índices!$A:$H,5,0)),\"\")","v":""},{"$f":"IFERROR(IF(B246=\"\",\"\",VLOOKUP(B246,Índices!$A:$H,6,0)),\"\")","v":""},{"$f":"IFERROR(IF(B246=\"\",\"\",$C$10*VLOOKUP(B246,Índices!$A:$H,7,0)/VLOOKUP(EDATE($C$8,-1),Índices!$A:$H,7,0)),\"\")","v":""},{"$f":"IFERROR(IF(B246=\"\",\"\",E246*(VLOOKUP(B246,Índices!$A:$H,8,0)-VLOOKUP(EDATE($C$8,-1),Índices!$A:$H,8,0))),\"\")","v":""},null,"vazia"]
[null,{"$f":"IFERROR(IF(EDATE($C$8,226)>$C$9,\"\",IF(EDATE($C$8,226)>DATE(2099,12,1),\"\",EDATE($C$8,226))),\"\")","v":""},{"$f":"IFERROR(IF(B247=\"\",\"\",VLOOKUP(B247,Índices!$A:$H,5,0)),\"\")","v":""},{"$f":"IFERROR(IF(B247=\"\",\"\",VLOOKUP(B247,Índices!$A:$H,6,0)),\"\")","v":""},{"$f":"IFERROR(IF(B247=\"\",\"\",$C$10*VLOOKUP(B247,Índices!$A:$H,7,0)/VLOOKUP(EDATE($C$8,-1),Índices!$A:$H,7,0)),\"\")","v":""},{"$f":"IFERROR(IF(B247=\"\",\"\",E247*(VLOOKUP(B247,Índices!$A:$H,8,0)-VLOOKUP(EDATE($C$8,-1),Índices!$A:$H,8,0))),\"\")","v":""},null,"vazia"]
[null,{"$f":"IFERROR(IF(EDATE($C$8,227)>$C$9,\"\",IF(EDATE($C$8,227)>DATE(2099,12,1),\"\",EDATE($C$8,227))),\"\")","v":""},{"$f":"IFERROR(IF(B248=\"\",\"\",VLOOKUP(B248,Índices!$A:$H,5,0)),\"\")","v":""},{"$f":"IFERROR(IF(B248=\"\",\"\",VLOOKUP(B248,Índices!$A:$H,6,0)),\"\")","v":""},{"$f":"IFERROR(IF(B248=\"\",\"\",$C$10*VLOOKUP(B248,Índices!$A:$H,7,0)/VLOOKUP(EDATE($C$8,-1),Índices!$A:$H,7,0)),\"\")","v":""},{"$f":"IFERROR(IF(B248=\"\",\"\",E248*(VLOOKUP(B248,Índices!$A:$H,8,0)-VLOOKUP(EDATE($C$8,-1),Índices!$A:$H,8,0))),\"\")","v":""},null,"vazia"]
[null,{"$f":"IFERROR(IF(EDATE($C$8,228)>$C$9,\"\",IF(EDATE($C$8,228)>DATE(2099,12,1),\"\",EDATE($C$8,228))),\"\")","v":""},{"$f":"IFERROR(IF(B249=\"\",\"\",VLOOKUP(B249,Índices!$A:$H,5,0)),\"\")","v":""},{"$f":"IFERROR(IF(B249=\"\",\"\",VLOOKUP(B249,Índices!$A:$H,6,0)),\"\")","v":""},{"$f":"IFERROR(IF(B249=\"\",\"\",$C$10*VLOOKUP(B249,Índices!$A:$H,7,0)/VLOOKUP(EDATE($C$8,-1),Índices!$A:$H,7,0)),\"\")","v":""},{"$f":"IFERROR(IF(B249=\"\",\"\",E249*(VLOOKUP(B249,Índices!$A:$H,8,0)-VLOOKUP(EDATE($C$8,-1),Índices!$A:$H,8,0))),\"\")","v":""},null,"vazia"]
[null,{"$f":"IFERROR(IF(EDATE($C$8,229)>$C$9,\"\",IF(EDATE($C$8,229)>DATE(2099,12,1),\"\",EDATE($C$8,229))),\"\")","v":""},{"$f":"IFERROR(IF(B250=\"\",\"\",VLOOKUP(B250,Índices!$A:$H,5,0)),\"\")","v":""},{"$f":"IFERROR(IF(B250=\"\",\"\",VLOOKUP(B250,Índices!$A:$H,6,0)),\"\")","v":""},{"$f":"IFERROR(IF(B250=\"\",\"\",$C$10*VLOOKUP(B250,Índices!$A:$H,7,0)/VLOOKUP(EDATE($C$8,-1),Índices!$A:$H,7,0)),\"\")","v":""},{"$f":"IFERROR(IF(B250=\"\",\"\",E250*(VLOOKUP(B250,Índices!$A:$H,8,0)-VLOOKUP(EDATE($C$8,-1),Índices!$A:$H,8,0))),\"\")","v":""},null,"vazia"]
[null,{"$f":"IFERROR(IF(EDATE($C$8,230)>$C$9,\"\",IF(EDATE($C$8,230)>DATE(2099,12,1),\"\",EDATE($C$8,230))),\"\")","v":""},{"$f":"IFERROR(IF(B251=\"\",\"\",VLOOKUP(B251,Índices!$A:$H,5,0)),\"\")","v":""},{"$f":"IFERROR(IF(B251=\"\",\"\",VLOOKUP(B251,Índices!$A:$H,6,0)),\"\")","v":""},{"$f":"IFERROR(IF(B251=\"\",\"\",$C$10*VLOOKUP(B251,Índices!$A:$H,7,0)/VLOOKUP(EDATE($C$8,-1),Índices!$A:$H,7,0)),\"\")","v":""},{"$f":"IFERROR(IF(B251=\"\",\"\",E251*(VLOOKUP(B251,Índices!$A:$H,8,0)-VLOOKUP(EDATE($C$8,-1),Índices!$A:$H,8,0))),\"\")","v":""},null,"vazia"]
[null,{"$f":"IFERROR(IF(EDATE($C$8,231)>$C$9,\"\",IF(EDATE($C$8,231)>DATE(2099,12,1),\"\",EDATE($C$8,231))),\"\")","v":""},{"$f":"IFERROR(IF(B252=\"\",\"\",VLOOKUP(B252,Índices!$A:$H,5,0)),\"\")","v":""},{"$f":"IFERROR(IF(B252=\"\",\"\",VLOOKUP(B252,Índices!$A:$H,6,0)),\"\")","v":""},{"$f":"IFERROR(IF(B252=\"\",\"\",$C$10*VLOOKUP(B252,Índices!$A:$H,7,0)/VLOOKUP(EDATE($C$8,-1),Índices!$A:$H,7,0)),\"\")","v":""},{"$f":"IFERROR(IF(B252=\"\",\"\",E252*(VLOOKUP(B252,Índices!$A:$H,8,0)-VLOOKUP(EDATE($C$8,-1),Índices!$A:$H,8,0))),\"\")","v":""},null,"vazia"]
[null,{"$f":"IFERROR(IF(EDATE($C$8,232)>$C$9,\"\",IF(EDATE($C$8,232)>DATE(2099,12,1),\"\",EDATE($C$8,232))),\"\")","v":""},{"$f":"IFERROR(IF(B253=\"\",\"\",VLOOKUP(B253,Índices!$A:$H,5,0)),\"\")","v":""},{"$f":"IFERROR(IF(B253=\"\",\"\",VLOOKUP(B253,Índices!$A:$H,6,0)),\"\")","v":""},{"$f":"IFERROR(IF(B253=\"\",\"\",$C$10*VLOOKUP(B253,Índices!$A:$H,7,0)/VLOOKUP(EDATE($C$8,-1),Índices!$A:$H,7,0)),\"\")","v":""},{"$f":"IFERROR(IF(B253=\"\",\"\",E253*(VLOOKUP(B253,Índices!$A:$H,8,0)-VLOOKUP(EDATE($C$8,-1),Índices!$A:$H,8,0))),\"\")","v":""},null,"vazia"]
[null,{"$f":"IFERROR(IF(EDATE($C$8,233)>$C$9,\"\",IF(EDATE($C$8,233)>DATE(2099,12,1),\"\",EDATE($C$8,233))),\"\")","v":""},{"$f":"IFERROR(IF(B254=\"\",\"\",VLOOKUP(B254,Índices!$A:$H,5,0)),\"\")","v":""},{"$f":"IFERROR(IF(B254=\"\",\"\",VLOOKUP(B254,Índices!$A:$H,6,0)),\"\")","v":""},{"$f":"IFERROR(IF(B254=\"\",\"\",$C$10*VLOOKUP(B254,Índices!$A:$H,7,0)/VLOOKUP(EDATE($C$8,-1),Índices!$A:$H,7,0)),\"\")","v":""},{"$f":"IFERROR(IF(B254=\"\",\"\",E254*(VLOOKUP(B254,Índices!$A:$H,8,0)-VLOOKUP(EDATE($C$8,-1),Índices!$A:$H,8,0))),\"\")","v":""},null,"vazia"]
[null,{"$f":"IFERROR(IF(EDATE($C$8,234)>$C$9,\"\",IF(EDATE($C$8,234)>DATE(2099,12,1),\"\",EDATE($C$8,234))),\"\")","v":""},{"$f":"IFERROR(IF(B255=\"\",\"\",VLOOKUP(B255,Índices!$A:$H,5,0)),\"\")","v":""},{"$f":"IFERROR(IF(B255=\"\",\"\",VLOOKUP(B255,Índices!$A:$H,6,0)),\"\")","v":""},{"$f":"IFERROR(IF(B255=\"\",\"\",$C$10*VLOOKUP(B255,Índices!$A:$H,7,0)/VLOOKUP(EDATE($C$8,-1),Índices!$A:$H,7,0)),\"\")","v":""},{"$f":"IFERROR(IF(B255=\"\",\"\",E255*(VLOOKUP(B255,Índices!$A:$H,8,0)-VLOOKUP(EDATE($C$8,-1),Índices!$A:$H,8,0))),\"\")","v":""},null,"vazia"]
[null,{"$f":"IFERROR(IF(EDATE($C$8,235)>$C$9,\"\",IF(EDATE($C$8,235)>DATE(2099,12,1),\"\",EDATE($C$8,235))),\"\")","v":""},{"$f":"IFERROR(IF(B256=\"\",\"\",VLOOKUP(B256,Índices!$A:$H,5,0)),\"\")","v":""},{"$f":"IFERROR(IF(B256=\"\",\"\",VLOOKUP(B256,Índices!$A:$H,6,0)),\"\")","v":""},{"$f":"IFERROR(IF(B256=\"\",\"\",$C$10*VLOOKUP(B256,Índices!$A:$H,7,0)/VLOOKUP(EDATE($C$8,-1),Índices!$A:$H,7,0)),\"\")","v":""},{"$f":"IFERROR(IF(B256=\"\",\"\",E256*(VLOOKUP(B256,Índices!$A:$H,8,0)-VLOOKUP(EDATE($C$8,-1),Índices!$A:$H,8,0))),\"\")","v":""},null,"vazia"]
[null,{"$f":"IFERROR(IF(EDATE($C$8,236)>$C$9,\"\",IF(EDATE($C$8,236)>DATE(2099,12,1),\"\",EDATE($C$8,236))),\"\")","v":""},{"$f":"IFERROR(IF(B257=\"\",\"\",VLOOKUP(B257,Índices!$A:$H,5,0)),\"\")","v":""},{"$f":"IFERROR(IF(B257=\"\",\"\",VLOOKUP(B257,Índices!$A:$H,6,0)),\"\")","v":""},{"$f":"IFERROR(IF(B257=\"\",\"\",$C$10*VLOOKUP(B257,Índices!$A:$H,7,0)/VLOOKUP(EDATE($C$8,-1),Índices!$A:$H,7,0)),\"\")","v":""},{"$f":"IFERROR(IF(B257=\"\",\"\",E257*(VLOOKUP(B257,Índices!$A:$H,8,0)-VLOOKUP(EDATE($C$8,-1),Índices!$A:$H,8,0))),\"\")","v":""},null,"vazia"]
[null,{"$f":"IFERROR(IF(EDATE($C$8,237)>$C$9,\"\",IF(EDATE($C$8,237)>DATE(2099,12,1),\"\",EDATE($C$8,237))),\"\")","v":""},{"$f":"IFERROR(IF(B258=\"\",\"\",VLOOKUP(B258,Índices!$A:$H,5,0)),\"\")","v":""},{"$f":"IFERROR(IF(B258=\"\",\"\",VLOOKUP(B258,Índices!$A:$H,6,0)),\"\")","v":""},{"$f":"IFERROR(IF(B258=\"\",\"\",$C$10*VLOOKUP(B258,Índices!$A:$H,7,0)/VLOOKUP(EDATE($C$8,-1),Índices!$A:$H,7,0)),\"\")","v":""},{"$f":"IFERROR(IF(B258=\"\",\"\",E258*(VLOOKUP(B258,Índices!$A:$H,8,0)-VLOOKUP(EDATE($C$8,-1),Índices!$A:$H,8,0))),\"\")","v":""},null,"vazia"]
[null,{"$f":"IFERROR(IF(EDATE($C$8,238)>$C$9,\"\",IF(EDATE($C$8,238)>DATE(2099,12,1),\"\",EDATE($C$8,238))),\"\")","v":""},{"$f":"IFERROR(IF(B259=\"\",\"\",VLOOKUP(B259,Índices!$A:$H,5,0)),\"\")","v":""},{"$f":"IFERROR(IF(B259=\"\",\"\",VLOOKUP(B259,Índices!$A:$H,6,0)),\"\")","v":""},{"$f":"IFERROR(IF(B259=\"\",\"\",$C$10*VLOOKUP(B259,Índices!$A:$H,7,0)/VLOOKUP(EDATE($C$8,-1),Índices!$A:$H,7,0)),\"\")","v":""},{"$f":"IFERROR(IF(B259=\"\",\"\",E259*(VLOOKUP(B259,Índices!$A:$H,8,0)-VLOOKUP(EDATE($C$8,-1),Índices!$A:$H,8,0))),\"\")","v":""},null,"vazia"]
[null,{"$f":"IFERROR(IF(EDATE($C$8,239)>$C$9,\"\",IF(EDATE($C$8,239)>DATE(2099,12,1),\"\",EDATE($C$8,239))),\"\")","v":""},{"$f":"IFERROR(IF(B260=\"\",\"\",VLOOKUP(B260,Índices!$A:$H,5,0)),\"\")","v":""},{"$f":"IFERROR(IF(B260=\"\",\"\",VLOOKUP(B260,Índices!$A:$H,6,0)),\"\")","v":""},{"$f":"IFERROR(IF(B260=\"\",\"\",$C$10*VLOOKUP(B260,Índices!$A:$H,7,0)/VLOOKUP(EDATE($C$8,-1),Índices!$A:$H,7,0)),\"\")","v":""},{"$f":"IFERROR(IF(B260=\"\",\"\",E260*(VLOOKUP(B260,Índices!$A:$H,8,0)-VLOOKUP(EDATE($C$8,-1),Índices!$A:$H,8,0))),\"\")","v":""},null,"vazia"]
[null,{"$f":"IFERROR(IF(EDATE($C$8,240)>$C$9,\"\",IF(EDATE($C$8,240)>DATE(2099,12,1),\"\",EDATE($C$8,240))),\"\")","v":""},{"$f":"IFERROR(IF(B261=\"\",\"\",VLOOKUP(B261,Índices!$A:$H,5,0)),\"\")","v":""},{"$f":"IFERROR(IF(B261=\"\",\"\",VLOOKUP(B261,Índices!$A:$H,6,0)),\"\")","v":""},{"$f":"IFERROR(IF(B261=\"\",\"\",$C$10*VLOOKUP(B261,Índices!$A:$H,7,0)/VLOOKUP(EDATE($C$8,-1),Índices!$A:$H,7,0)),\"\")","v":""},{"$f":"IFERROR(IF(B261=\"\",\"\",E261*(VLOOKUP(B261,Índices!$A:$H,8,0)-VLOOKUP(EDATE($C$8,-1),Índices!$A:$H,8,0))),\"\")","v":""},null,"vazia"]
[null,{"$f":"IFERROR(IF(EDATE($C$8,241)>$C$9,\"\",IF(EDATE($C$8,241)>DATE(2099,12,1),\"\",EDATE($C$8,241))),\"\")","v":""},{"$f":"IFERROR(IF(B262=\"\",\"\",VLOOKUP(B262,Índices!$A:$H,5,0)),\"\")","v":""},{"$f":"IFERROR(IF(B262=\"\",\"\",VLOOKUP(B262,Índices!$A:$H,6,0)),\"\")","v":""},{"$f":"IFERROR(IF(B262=\"\",\"\",$C$10*VLOOKUP(B262,Índices!$A:$H,7,0)/VLOOKUP(EDATE($C$8,-1),Índices!$A:$H,7,0)),\"\")","v":""},{"$f":"IFERROR(IF(B262=\"\",\"\",E262*(VLOOKUP(B262,Índices!$A:$H,8,0)-VLOOKUP(EDATE($C$8,-1),Índices!$A:$H,8,0))),\"\")","v":""},null,"vazia"]
[null,{"$f":"IFERROR(IF(EDATE($C$8,242)>$C$9,\"\",IF(EDATE($C$8,242)>DATE(2099,12,1),\"\",EDATE($C$8,242))),\"\")","v":""},{"$f":"IFERROR(IF(B263=\"\",\"\",VLOOKUP(B263,Índices!$A:$H,5,0)),\"\")","v":""},{"$f":"IFERROR(IF(B263=\"\",\"\",VLOOKUP(B263,Índices!$A:$H,6,0)),\"\")","v":""},{"$f":"IFERROR(IF(B263=\"\",\"\",$C$10*VLOOKUP(B263,Índices!$A:$H,7,0)/VLOOKUP(EDATE($C$8,-1),Índices!$A:$H,7,0)),\"\")","v":""},{"$f":"IFERROR(IF(B263=\"\",\"\",E263*(VLOOKUP(B263,Índices!$A:$H,8,0)-VLOOKUP(EDATE($C$8,-1),Índices!$A:$H,8,0))),\"\")","v":""},null,"vazia"]
[null,{"$f":"IFERROR(IF(EDATE($C$8,243)>$C$9,\"\",IF(EDATE($C$8,243)>DATE(2099,12,1),\"\",EDATE($C$8,243))),\"\")","v":""},{"$f":"IFERROR(IF(B264=\"\",\"\",VLOOKUP(B264,Índices!$A:$H,5,0)),\"\")","v":""},{"$f":"IFERROR(IF(B264=\"\",\"\",VLOOKUP(B264,Índices!$A:$H,6,0)),\"\")","v":""},{"$f":"IFERROR(IF(B264=\"\",\"\",$C$10*VLOOKUP(B264,Índices!$A:$H,7,0)/VLOOKUP(EDATE($C$8,-1),Índices!$A:$H,7,0)),\"\")","v":""},{"$f":"IFERROR(IF(B264=\"\",\"\",E264*(VLOOKUP(B264,Índices!$A:$H,8,0)-VLOOKUP(EDATE($C$8,-1),Índices!$A:$H,8,0))),\"\")","v":""},null,"vazia"]
[null,{"$f":"IFERROR(IF(EDATE($C$8,244)>$C$9,\"\",IF(EDATE($C$8,244)>DATE(2099,12,1),\"\",EDATE($C$8,244))),\"\")","v":""},{"$f":"IFERROR(IF(B265=\"\",\"\",VLOOKUP(B265,Índices!$A:$H,5,0)),\"\")","v":""},{"$f":"IFERROR(IF(B265=\"\",\"\",VLOOKUP(B265,Índices!$A:$H,6,0)),\"\")","v":""},{"$f":"IFERROR(IF(B265=\"\",\"\",$C$10*VLOOKUP(B265,Índices!$A:$H,7,0)/VLOOKUP(EDATE($C$8,-1),Índices!$A:$H,7,0)),\"\")","v":""},{"$f":"IFERROR(IF(B265=\"\",\"\",E265*(VLOOKUP(B265,Índices!$A:$H,8,0)-VLOOKUP(EDATE($C$8,-1),Índices!$A:$H,8,0))),\"\")","v":""},null,"vazia"]
[null,{"$f":"IFERROR(IF(EDATE($C$8,245)>$C$9,\"\",IF(EDATE($C$8,245)>DATE(2099,12,1),\"\",EDATE($C$8,245))),\"\")","v":""},{"$f":"IFERROR(IF(B266=\"\",\"\",VLOOKUP(B266,Índices!$A:$H,5,0)),\"\")","v":""},{"$f":"IFERROR(IF(B266=\"\",\"\",VLOOKUP(B266,Índices!$A:$H,6,0)),\"\")","v":""},{"$f":"IFERROR(IF(B266=\"\",\"\",$C$10*VLOOKUP(B266,Índices!$A:$H,7,0)/VLOOKUP(EDATE($C$8,-1),Índices!$A:$H,7,0)),\"\")","v":""},{"$f":"IFERROR(IF(B266=\"\",\"\",E266*(VLOOKUP(B266,Índices!$A:$H,8,0)-VLOOKUP(EDATE($C$8,-1),Índices!$A:$H,8,0))),\"\")","v":""},null,"vazia"]
[null,{"$f":"IFERROR(IF(EDATE($C$8,246)>$C$9,\"\",IF(EDATE($C$8,246)>DATE(2099,12,1),\"\",EDATE($C$8,246))),\"\")","v":""},{"$f":"IFERROR(IF(B267=\"\",\"\",VLOOKUP(B267,Índices!$A:$H,5,0)),\"\")","v":""},{"$f":"IFERROR(IF(B267=\"\",\"\",VLOOKUP(B267,Índices!$A:$H,6,0)),\"\")","v":""},{"$f":"IFERROR(IF(B267=\"\",\"\",$C$10*VLOOKUP(B267,Índices!$A:$H,7,0)/VLOOKUP(EDATE($C$8,-1),Índices!$A:$H,7,0)),\"\")","v":""},{"$f":"IFERROR(IF(B267=\"\",\"\",E267*(VLOOKUP(B267,Índices!$A:$H,8,0)-VLOOKUP(EDATE($C$8,-1),Índices!$A:$H,8,0))),\"\")","v":""},null,"vazia"]
[null,{"$f":"IFERROR(IF(EDATE($C$8,247)>$C$9,\"\",IF(EDATE($C$8,247)>DATE(2099,12,1),\"\",EDATE($C$8,247))),\"\")","v":""},{"$f":"IFERROR(IF(B268=\"\",\"\",VLOOKUP(B268,Índices!$A:$H,5,0)),\"\")","v":""},{"$f":"IFERROR(IF(B268=\"\",\"\",VLOOKUP(B268,Índices!$A:$H,6,0)),\"\")","v":""},{"$f":"IFERROR(IF(B268=\"\",\"\",$C$10*VLOOKUP(B268,Índices!$A:$H,7,0)/VLOOKUP(EDATE($C$8,-1),Índices!$A:$H,7,0)),\"\")","v":""},{"$f":"IFERROR(IF(B268=\"\",\"\",E268*(VLOOKUP(B268,Índices!$A:$H,8,0)-VLOOKUP(EDATE($C$8,-1),Índices!$A:$H,8,0))),\"\")","v":""},null,"vazia"]
[null,{"$f":"IFERROR(IF(EDATE($C$8,248)>$C$9,\"\",IF(EDATE($C$8,248)>DATE(2099,12,1),\"\",EDATE($C$8,248))),\"\")","v":""},{"$f":"IFERROR(IF(B269=\"\",\"\",VLOOKUP(B269,Índices!$A:$H,5,0)),\"\")","v":""},{"$f":"IFERROR(IF(B269=\"\",\"\",VLOOKUP(B269,Índices!$A:$H,6,0)),\"\")","v":""},{"$f":"IFERROR(IF(B269=\"\",\"\",$C$10*VLOOKUP(B269,Índices!$A:$H,7,0)/VLOOKUP(EDATE($C$8,-1),Índices!$A:$H,7,0)),\"\")","v":""},{"$f":"IFERROR(IF(B269=\"\",\"\",E269*(VLOOKUP(B269,Índices!$A:$H,8,0)-VLOOKUP(EDATE($C$8,-1),Índices!$A:$H,8,0))),\"\")","v":""},null,"vazia"]
[null,{"$f":"IFERROR(IF(EDATE($C$8,249)>$C$9,\"\",IF(EDATE($C$8,249)>DATE(2099,12,1),\"\",EDATE($C$8,249))),\"\")","v":""},{"$f":"IFERROR(IF(B270=\"\",\"\",VLOOKUP(B270,Índices!$A:$H,5,0)),\"\")","v":""},{"$f":"IFERROR(IF(B270=\"\",\"\",VLOOKUP(B270,Índices!$A:$H,6,0)),\"\")","v":""},{"$f":"IFERROR(IF(B270=\"\",\"\",$C$10*VLOOKUP(B270,Índices!$A:$H,7,0)/VLOOKUP(EDATE($C$8,-1),Índices!$A:$H,7,0)),\"\")","v":""},{"$f":"IFERROR(IF(B270=\"\",\"\",E270*(VLOOKUP(B270,Índices!$A:$H,8,0)-VLOOKUP(EDATE($C$8,-1),Índices!$A:$H,8,0))),\"\")","v":""},null,"vazia"]
[null,{"$f":"IFERROR(IF(EDATE($C$8,250)>$C$9,\"\",IF(EDATE($C$8,250)>DATE(2099,12,1),\"\",EDATE($C$8,250))),\"\")","v":""},{"$f":"IFERROR(IF(B271=\"\",\"\",VLOOKUP(B271,Índices!$A:$H,5,0)),\"\")","v":""},{"$f":"IFERROR(IF(B271=\"\",\"\",VLOOKUP(B271,Índices!$A:$H,6,0)),\"\")","v":""},{"$f":"IFERROR(IF(B271=\"\",\"\",$C$10*VLOOKUP(B271,Índices!$A:$H,7,0)/VLOOKUP(EDATE($C$8,-1),Índices!$A:$H,7,0)),\"\")","v":""},{"$f":"IFERROR(IF(B271=\"\",\"\",E271*(VLOOKUP(B271,Índices!$A:$H,8,0)-VLOOKUP(EDATE($C$8,-1),Índices!$A:$H,8,0))),\"\")","v":""},null,"vazia"]
[null,{"$f":"IFERROR(IF(EDATE($C$8,251)>$C$9,\"\",IF(EDATE($C$8,251)>DATE(2099,12,1),\"\",EDATE($C$8,251))),\"\")","v":""},{"$f":"IFERROR(IF(B272=\"\",\"\",VLOOKUP(B272,Índices!$A:$H,5,0)),\"\")","v":""},{"$f":"IFERROR(IF(B272=\"\",\"\",VLOOKUP(B272,Índices!$A:$H,6,0)),\"\")","v":""},{"$f":"IFERROR(IF(B272=\"\",\"\",$C$10*VLOOKUP(B272,Índices!$A:$H,7,0)/VLOOKUP(EDATE($C$8,-1),Índices!$A:$H,7,0)),\"\")","v":""},{"$f":"IFERROR(IF(B272=\"\",\"\",E272*(VLOOKUP(B272,Índices!$A:$H,8,0)-VLOOKUP(EDATE($C$8,-1),Índices!$A:$H,8,0))),\"\")","v":""},null,"vazia"]
[null,{"$f":"IFERROR(IF(EDATE($C$8,252)>$C$9,\"\",IF(EDATE($C$8,252)>DATE(2099,12,1),\"\",EDATE($C$8,252))),\"\")","v":""},{"$f":"IFERROR(IF(B273=\"\",\"\",VLOOKUP(B273,Índices!$A:$H,5,0)),\"\")","v":""},{"$f":"IFERROR(IF(B273=\"\",\"\",VLOOKUP(B273,Índices!$A:$H,6,0)),\"\")","v":""},{"$f":"IFERROR(IF(B273=\"\",\"\",$C$10*VLOOKUP(B273,Índices!$A:$H,7,0)/VLOOKUP(EDATE($C$8,-1),Índices!$A:$H,7,0)),\"\")","v":""},{"$f":"IFERROR(IF(B273=\"\",\"\",E273*(VLOOKUP(B273,Índices!$A:$H,8,0)-VLOOKUP(EDATE($C$8,-1),Índices!$A:$H,8,0))),\"\")","v":""},null,"vazia"]
[null,{"$f":"IFERROR(IF(EDATE($C$8,253)>$C$9,\"\",IF(EDATE($C$8,253)>DATE(2099,12,1),\"\",EDATE($C$8,253))),\"\")","v":""},{"$f":"IFERROR(IF(B274=\"\",\"\",VLOOKUP(B274,Índices!$A:$H,5,0)),\"\")","v":""},{"$f":"IFERROR(IF(B274=\"\",\"\",VLOOKUP(B274,Índices!$A:$H,6,0)),\"\")","v":""},{"$f":"IFERROR(IF(B274=\"\",\"\",$C$10*VLOOKUP(B274,Índices!$A:$H,7,0)/VLOOKUP(EDATE($C$8,-1),Índices!$A:$H,7,0)),\"\")","v":""},{"$f":"IFERROR(IF(B274=\"\",\"\",E274*(VLOOKUP(B274,Índices!$A:$H,8,0)-VLOOKUP(EDATE($C$8,-1),Índices!$A:$H,8,0))),\"\")","v":""},null,"vazia"]
[null,{"$f":"IFERROR(IF(EDATE($C$8,254)>$C$9,\"\",IF(EDATE($C$8,254)>DATE(2099,12,1),\"\",EDATE($C$8,254))),\"\")","v":""},{"$f":"IFERROR(IF(B275=\"\",\"\",VLOOKUP(B275,Índices!$A:$H,5,0)),\"\")","v":""},{"$f":"IFERROR(IF(B275=\"\",\"\",VLOOKUP(B275,Índices!$A:$H,6,0)),\"\")","v":""},{"$f":"IFERROR(IF(B275=\"\",\"\",$C$10*VLOOKUP(B275,Índices!$A:$H,7,0)/VLOOKUP(EDATE($C$8,-1),Índices!$A:$H,7,0)),\"\")","v":""},{"$f":"IFERROR(IF(B275=\"\",\"\",E275*(VLOOKUP(B275,Índices!$A:$H,8,0)-VLOOKUP(EDATE($C$8,-1),Índices!$A:$H,8,0))),\"\")","v":""},null,"vazia"]
[null,{"$f":"IFERROR(IF(EDATE($C$8,255)>$C$9,\"\",IF(EDATE($C$8,255)>DATE(2099,12,1),\"\",EDATE($C$8,255))),\"\")","v":""},{"$f":"IFERROR(IF(B276=\"\",\"\",VLOOKUP(B276,Índices!$A:$H,5,0)),\"\")","v":""},{"$f":"IFERROR(IF(B276=\"\",\"\",VLOOKUP(B276,Índices!$A:$H,6,0)),\"\")","v":""},{"$f":"IFERROR(IF(B276=\"\",\"\",$C$10*VLOOKUP(B276,Índices!$A:$H,7,0)/VLOOKUP(EDATE($C$8,-1),Índices!$A:$H,7,0)),\"\")","v":""},{"$f":"IFERROR(IF(B276=\"\",\"\",E276*(VLOOKUP(B276,Índices!$A:$H,8,0)-VLOOKUP(EDATE($C$8,-1),Índices!$A:$H,8,0))),\"\")","v":""},null,"vazia"]
[null,{"$f":"IFERROR(IF(EDATE($C$8,256)>$C$9,\"\",IF(EDATE($C$8,256)>DATE(2099,12,1),\"\",EDATE($C$8,256))),\"\")","v":""},{"$f":"IFERROR(IF(B277=\"\",\"\",VLOOKUP(B277,Índices!$A:$H,5,0)),\"\")","v":""},{"$f":"IFERROR(IF(B277=\"\",\"\",VLOOKUP(B277,Índices!$A:$H,6,0)),\"\")","v":""},{"$f":"IFERROR(IF(B277=\"\",\"\",$C$10*VLOOKUP(B277,Índices!$A:$H,7,0)/VLOOKUP(EDATE($C$8,-1),Índices!$A:$H,7,0)),\"\")","v":""},{"$f":"IFERROR(IF(B277=\"\",\"\",E277*(VLOOKUP(B277,Índices!$A:$H,8,0)-VLOOKUP(EDATE($C$8,-1),Índices!$A:$H,8,0))),\"\")","v":""},null,"vazia"]
[null,{"$f":"IFERROR(IF(EDATE($C$8,257)>$C$9,\"\",IF(EDATE($C$8,257)>DATE(2099,12,1),\"\",EDATE($C$8,257))),\"\")","v":""},{"$f":"IFERROR(IF(B278=\"\",\"\",VLOOKUP(B278,Índices!$A:$H,5,0)),\"\")","v":""},{"$f":"IFERROR(IF(B278=\"\",\"\",VLOOKUP(B278,Índices!$A:$H,6,0)),\"\")","v":""},{"$f":"IFERROR(IF(B278=\"\",\"\",$C$10*VLOOKUP(B278,Índices!$A:$H,7,0)/VLOOKUP(EDATE($C$8,-1),Índices!$A:$H,7,0)),\"\")","v":""},{"$f":"IFERROR(IF(B278=\"\",\"\",E278*(VLOOKUP(B278,Índices!$A:$H,8,0)-VLOOKUP(EDATE($C$8,-1),Índices!$A:$H,8,0))),\"\")","v":""},null,{"$f":"IF(B278=\"\",\"vazia\",\"1\")","v":"vazia"}]
[null,{"$f":"IFERROR(IF(EDATE($C$8,258)>$C$9,\"\",IF(EDATE($C$8,258)>DATE(2099,12,1),\"\",EDATE($C$8,258))),\"\")","v":""},{"$f":"IFERROR(IF(B279=\"\",\"\",VLOOKUP(B279,Índices!$A:$H,5,0)),\"\")","v":""},{"$f":"IFERROR(IF(B279=\"\",\"\",VLOOKUP(B279,Índices!$A:$H,6,0)),\"\")","v":""},{"$f":"IFERROR(IF(B279=\"\",\"\",$C$10*VLOOKUP(B279,Índices!$A:$H,7,0)/VLOOKUP(EDATE($C$8,-1),Índices!$A:$H,7,0)),\"\")","v":""},{"$f":"IFERROR(IF(B279=\"\",\"\",E279*(VLOOKUP(B279,Índices!$A:$H,8,0)-VLOOKUP(EDATE($C$8,-1),Índices!$A:$H,8,0))),\"\")","v":""},null,"vazia"]
[null,{"$f":"IFERROR(IF(EDATE($C$8,259)>$C$9,\"\",IF(EDATE($C$8,259)>DATE(2099,12,1),\"\",EDATE($C$8,259))),\"\")","v":""},{"$f":"IFERROR(IF(B280=\"\",\"\",VLOOKUP(B280,Índices!$A:$H,5,0)),\"\")","v":""},{"$f":"IFERROR(IF(B280=\"\",\"\",VLOOKUP(B280,Índices!$A:$H,6,0)),\"\")","v":""},{"$f":"IFERROR(IF(B280=\"\",\"\",$C$10*VLOOKUP(B280,Índices!$A:$H,7,0)/VLOOKUP(EDATE($C$8,-1),Índices!$A:$H,7,0)),\"\")","v":""},{"$f":"IFERROR(IF(B280=\"\",\"\",E280*(VLOOKUP(B280,Índices!$A:$H,8,0)-VLOOKUP(EDATE($C$8,-1),Índices!$A:$H,8,0))),\"\")","v":""},null,"vazia"]
[null,{"$f":"IFERROR(IF(EDATE($C$8,260)>$C$9,\"\",IF(EDATE($C$8,260)>DATE(2099,12,1),\"\",EDATE($C$8,260))),\"\")","v":""},{"$f":"IFERROR(IF(B281=\"\",\"\",VLOOKUP(B281,Índices!$A:$H,5,0)),\"\")","v":""},{"$f":"IFERROR(IF(B281=\"\",\"\",VLOOKUP(B281,Índices!$A:$H,6,0)),\"\")","v":""},{"$f":"IFERROR(IF(B281=\"\",\"\",$C$10*VLOOKUP(B281,Índices!$A:$H,7,0)/VLOOKUP(EDATE($C$8,-1),Índices!$A:$H,7,0)),\"\")","v":""},{"$f":"IFERROR(IF(B281=\"\",\"\",E281*(VLOOKUP(B281,Índices!$A:$H,8,0)-VLOOKUP(EDATE($C$8,-1),Índices!$A:$H,8,0))),\"\")","v":""},null,"vazia"]
[null,{"$f":"IFERROR(IF(EDATE($C$8,261)>$C$9,\"\",IF(EDATE($C$8,261)>DATE(2099,12,1),\"\",EDATE($C$8,261))),\"\")","v":""},{"$f":"IFERROR(IF(B282=\"\",\"\",VLOOKUP(B282,Índices!$A:$H,5,0)),\"\")","v":""},{"$f":"IFERROR(IF(B282=\"\",\"\",VLOOKUP(B282,Índices!$A:$H,6,0)),\"\")","v":""},{"$f":"IFERROR(IF(B282=\"\",\"\",$C$10*VLOOKUP(B282,Índices!$A:$H,7,0)/VLOOKUP(EDATE($C$8,-1),Índices!$A:$H,7,0)),\"\")","v":""},{"$f":"IFERROR(IF(B282=\"\",\"\",E282*(VLOOKUP(B282,Índices!$A:$H,8,0)-VLOOKUP(EDATE($C$8,-1),Índices!$A:$H,8,0))),\"\")","v":""},null,"vazia"]
[null,{"$f":"IFERROR(IF(EDATE($C$8,262)>$C$9,\"\",IF(EDATE($C$8,262)>DATE(2099,12,1),\"\",EDATE($C$8,262))),\"\")","v":""},{"$f":"IFERROR(IF(B283=\"\",\"\",VLOOKUP(B283,Índices!$A:$H,5,0)),\"\")","v":""},{"$f":"IFERROR(IF(B283=\"\",\"\",VLOOKUP(B283,Índices!$A:$H,6,0)),\"\")","v":""},{"$f":"IFERROR(IF(B283=\"\",\"\",$C$10*VLOOKUP(B283,Índices!$A:$H,7,0)/VLOOKUP(EDATE($C$8,-1),Índices!$A:$H,7,0)),\"\")","v":""},{"$f":"IFERROR(IF(B283=\"\",\"\",E283*(VLOOKUP(B283,Índices!$A:$H,8,0)-VLOOKUP(EDATE($C$8,-1),Índices!$A:$H,8,0))),\"\")","v":""},null,"vazia"]
[null,{"$f":"IFERROR(IF(EDATE($C$8,263)>$C$9,\"\",IF(EDATE($C$8,263)>DATE(2099,12,1),\"\",EDATE($C$8,263))),\"\")","v":""},{"$f":"IFERROR(IF(B284=\"\",\"\",VLOOKUP(B284,Índices!$A:$H,5,0)),\"\")","v":""},{"$f":"IFERROR(IF(B284=\"\",\"\",VLOOKUP(B284,Índices!$A:$H,6,0)),\"\")","v":""},{"$f":"IFERROR(IF(B284=\"\",\"\",$C$10*VLOOKUP(B284,Índices!$A:$H,7,0)/VLOOKUP(EDATE($C$8,-1),Índices!$A:$H,7,0)),\"\")","v":""},{"$f":"IFERROR(IF(B284=\"\",\"\",E284*(VLOOKUP(B284,Índices!$A:$H,8,0)-VLOOKUP(EDATE($C$8,-1),Índices!$A:$H,8,0))),\"\")","v":""},null,"vazia"]
[null,{"$f":"IFERROR(IF(EDATE($C$8,264)>$C$9,\"\",IF(EDATE($C$8,264)>DATE(2099,12,1),\"\",EDATE($C$8,264))),\"\")","v":""},{"$f":"IFERROR(IF(B285=\"\",\"\",VLOOKUP(B285,Índices!$A:$H,5,0)),\"\")","v":""},{"$f":"IFERROR(IF(B285=\"\",\"\",VLOOKUP(B285,Índices!$A:$H,6,0)),\"\")","v":""},{"$f":"IFERROR(IF(B285=\"\",\"\",$C$10*VLOOKUP(B285,Índices!$A:$H,7,0)/VLOOKUP(EDATE($C$8,-1),Índices!$A:$H,7,0)),\"\")","v":""},{"$f":"IFERROR(IF(B285=\"\",\"\",E285*(VLOOKUP(B285,Índices!$A:$H,8,0)-VLOOKUP(EDATE($C$8,-1),Índices!$A:$H,8,0))),\"\")","v":""},null,"vazia"]
[null,{"$f":"IFERROR(IF(EDATE($C$8,265)>$C$9,\"\",IF(EDATE($C$8,265)>DATE(2099,12,1),\"\",EDATE($C$8,265))),\"\")","v":""},{"$f":"IFERROR(IF(B286=\"\",\"\",VLOOKUP(B286,Índices!$A:$H,5,0)),\"\")","v":""},{"$f":"IFERROR(IF(B286=\"\",\"\",VLOOKUP(B286,Índices!$A:$H,6,0)),\"\")","v":""},{"$f":"IFERROR(IF(B286=\"\",\"\",$C$10*VLOOKUP(B286,Índices!$A:$H,7,0)/VLOOKUP(EDATE($C$8,-1),Índices!$A:$H,7,0)),\"\")","v":""},{"$f":"IFERROR(IF(B286=\"\",\"\",E286*(VLOOKUP(B286,Índices!$A:$H,8,0)-VLOOKUP(EDATE($C$8,-1),Índices!$A:$H,8,0))),\"\")","v":""},null,"vazia"]
[null,{"$f":"IFERROR(IF(EDATE($C$8,266)>$C$9,\"\",IF(EDATE($C$8,266)>DATE(2099,12,1),\"\",EDATE($C$8,266))),\"\")","v":""},{"$f":"IFERROR(IF(B287=\"\",\"\",VLOOKUP(B287,Índices!$A:$H,5,0)),\"\")","v":""},{"$f":"IFERROR(IF(B287=\"\",\"\",VLOOKUP(B287,Índices!$A:$H,6,0)),\"\")","v":""},{"$f":"IFERROR(IF(B287=\"\",\"\",$C$10*VLOOKUP(B287,Índices!$A:$H,7,0)/VLOOKUP(EDATE($C$8,-1),Índices!$A:$H,7,0)),\"\")","v":""},{"$f":"IFERROR(IF(B287=\"\",\"\",E287*(VLOOKUP(B287,Índices!$A:$H,8,0)-VLOOKUP(EDATE($C$8,-1),Índices!$A:$H,8,0))),\"\")","v":""},null,"vazia"]
[null,{"$f":"IFERROR(IF(EDATE($C$8,267)>$C$9,\"\",IF(EDATE($C$8,267)>DATE(2099,12,1),\"\",EDATE($C$8,267))),\"\")","v":""},{"$f":"IFERROR(IF(B288=\"\",\"\",VLOOKUP(B288,Índices!$A:$H,5,0)),\"\")","v":""},{"$f":"IFERROR(IF(B288=\"\",\"\",VLOOKUP(B288,Índices!$A:$H,6,0)),\"\")","v":""},{"$f":"IFERROR(IF(B288=\"\",\"\",$C$10*VLOOKUP(B288,Índices!$A:$H,7,0)/VLOOKUP(EDATE($C$8,-1),Índices!$A:$H,7,0)),\"\")","v":""},{"$f":"IFERROR(IF(B288=\"\",\"\",E288*(VLOOKUP(B288,Índices!$A:$H,8,0)-VLOOKUP(EDATE($C$8,-1),Índices!$A:$H,8,0))),\"\")","v":""},null,"vazia"]
[null,{"$f":"IFERROR(IF(EDATE($C$8,268)>$C$9,\"\",IF(EDATE($C$8,268)>DATE(2099,12,1),\"\",EDATE($C$8,268))),\"\")","v":""},{"$f":"IFERROR(IF(B289=\"\",\"\",VLOOKUP(B289,Índices!$A:$H,5,0)),\"\")","v":""},{"$f":"IFERROR(IF(B289=\"\",\"\",VLOOKUP(B289,Índices!$A:$H,6,0)),\"\")","v":""},{"$f":"IFERROR(IF(B289=\"\",\"\",$C$10*VLOOKUP(B289,Índices!$A:$H,7,0)/VLOOKUP(EDATE($C$8,-1),Índices!$A:$H,7,0)),\"\")","v":""},{"$f":"IFERROR(IF(B289=\"\",\"\",E289*(VLOOKUP(B289,Índices!$A:$H,8,0)-VLOOKUP(EDATE($C$8,-1),Índices!$A:$H,8,0))),\"\")","v":""},null,"vazia"]
[null,{"$f":"IFERROR(IF(EDATE($C$8,269)>$C$9,\"\",IF(EDATE($C$8,269)>DATE(2099,12,1),\"\",EDATE($C$8,269))),\"\")","v":""},{"$f":"IFERROR(IF(B290=\"\",\"\",VLOOKUP(B290,Índices!$A:$H,5,0)),\"\")","v":""},{"$f":"IFERROR(IF(B290=\"\",\"\",VLOOKUP(B290,Índices!$A:$H,6,0)),\"\")","v":""},{"$f":"IFERROR(IF(B290=\"\",\"\",$C$10*VLOOKUP(B290,Índices!$A:$H,7,0)/VLOOKUP(EDATE($C$8,-1),Índices!$A:$H,7,0)),\"\")","v":""},{"$f":"IFERROR(IF(B290=\"\",\"\",E290*(VLOOKUP(B290,Índices!$A:$H,8,0)-VLOOKUP(EDATE($C$8,-1),Índices!$A:$H,8,0))),\"\")","v":""},null,"vazia"]
[null,{"$f":"IFERROR(IF(EDATE($C$8,270)>$C$9,\"\",IF(EDATE($C$8,270)>DATE(2099,12,1),\"\",EDATE($C$8,270))),\"\")","v":""},{"$f":"IFERROR(IF(B291=\"\",\"\",VLOOKUP(B291,Índices!$A:$H,5,0)),\"\")","v":""},{"$f":"IFERROR(IF(B291=\"\",\"\",VLOOKUP(B291,Índices!$A:$H,6,0)),\"\")","v":""},{"$f":"IFERROR(IF(B291=\"\",\"\",$C$10*VLOOKUP(B291,Índices!$A:$H,7,0)/VLOOKUP(EDATE($C$8,-1),Índices!$A:$H,7,0)),\"\")","v":""},{"$f":"IFERROR(IF(B291=\"\",\"\",E291*(VLOOKUP(B291,Índices!$A:$H,8,0)-VLOOKUP(EDATE($C$8,-1),Índices!$A:$H,8,0))),\"\")","v":""},null,"vazia"]
[null,{"$f":"IFERROR(IF(EDATE($C$8,271)>$C$9,\"\",IF(EDATE($C$8,271)>DATE(2099,12,1),\"\",EDATE($C$8,271))),\"\")","v":""},{"$f":"IFERROR(IF(B292=\"\",\"\",VLOOKUP(B292,Índices!$A:$H,5,0)),\"\")","v":""},{"$f":"IFERROR(IF(B292=\"\",\"\",VLOOKUP(B292,Índices!$A:$H,6,0)),\"\")","v":""},{"$f":"IFERROR(IF(B292=\"\",\"\",$C$10*VLOOKUP(B292,Índices!$A:$H,7,0)/VLOOKUP(EDATE($C$8,-1),Índices!$A:$H,7,0)),\"\")","v":""},{"$f":"IFERROR(IF(B292=\"\",\"\",E292*(VLOOKUP(B292,Índices!$A:$H,8,0)-VLOOKUP(EDATE($C$8,-1),Índices!$A:$H,8,0))),\"\")","v":""},null,"vazia"]
[null,{"$f":"IFERROR(IF(EDATE($C$8,272)>$C$9,\"\",IF(EDATE($C$8,272)>DATE(2099,12,1),\"\",EDATE($C$8,272))),\"\")","v":""},{"$f":"IFERROR(IF(B293=\"\",\"\",VLOOKUP(B293,Índices!$A:$H,5,0)),\"\")","v":""},{"$f":"IFERROR(IF(B293=\"\",\"\",VLOOKUP(B293,Índices!$A:$H,6,0)),\"\")","v":""},{"$f":"IFERROR(IF(B293=\"\",\"\",$C$10*VLOOKUP(B293,Índices!$A:$H,7,0)/VLOOKUP(EDATE($C$8,-1),Índices!$A:$H,7,0)),\"\")","v":""},{"$f":"IFERROR(IF(B293=\"\",\"\",E293*(VLOOKUP(B293,Índices!$A:$H,8,0)-VLOOKUP(EDATE($C$8,-1),Índices!$A:$H,8,0))),\"\")","v":""},null,"vazia"]
[null,{"$f":"IFERROR(IF(EDATE($C$8,273)>$C$9,\"\",IF(EDATE($C$8,273)>DATE(2099,12,1),\"\",EDATE($C$8,273))),\"\")","v":""},{"$f":"IFERROR(IF(B294=\"\",\"\",VLOOKUP(B294,Índices!$A:$H,5,0)),\"\")","v":""},{"$f":"IFERROR(IF(B294=\"\",\"\",VLOOKUP(B294,Índices!$A:$H,6,0)),\"\")","v":""},{"$f":"IFERROR(IF(B294=\"\",\"\",$C$10*VLOOKUP(B294,Índices!$A:$H,7,0)/VLOOKUP(EDATE($C$8,-1),Índices!$A:$H,7,0)),\"\")","v":""},{"$f":"IFERROR(IF(B294=\"\",\"\",E294*(VLOOKUP(B294,Índices!$A:$H,8,0)-VLOOKUP(EDATE($C$8,-1),Índices!$A:$H,8,0))),\"\")","v":""},null,"vazia"]
[null,{"$f":"IFERROR(IF(EDATE($C$8,274)>$C$9,\"\",IF(EDATE($C$8,274)>DATE(2099,12,1),\"\",EDATE($C$8,274))),\"\")","v":""},{"$f":"IFERROR(IF(B295=\"\",\"\",VLOOKUP(B295,Índices!$A:$H,5,0)),\"\")","v":""},{"$f":"IFERROR(IF(B295=\"\",\"\",VLOOKUP(B295,Índices!$A:$H,6,0)),\"\")","v":""},{"$f":"IFERROR(IF(B295=\"\",\"\",$C$10*VLOOKUP(B295,Índices!$A:$H,7,0)/VLOOKUP(EDATE($C$8,-1),Índices!$A:$H,7,0)),\"\")","v":""},{"$f":"IFERROR(IF(B295=\"\",\"\",E295*(VLOOKUP(B295,Índices!$A:$H,8,0)-VLOOKUP(EDATE($C$8,-1),Índices!$A:$H,8,0))),\"\")","v":""},null,"vazia"]
[null,{"$f":"IFERROR(IF(EDATE($C$8,275)>$C$9,\"\",IF(EDATE($C$8,275)>DATE(2099,12,1),\"\",EDATE($C$8,275))),\"\")","v":""},{"$f":"IFERROR(IF(B296=\"\",\"\",VLOOKUP(B296,Índices!$A:$H,5,0)),\"\")","v":""},{"$f":"IFERROR(IF(B296=\"\",\"\",VLOOKUP(B296,Índices!$A:$H,6,0)),\"\")","v":""},{"$f":"IFERROR(IF(B296=\"\",\"\",$C$10*VLOOKUP(B296,Índices!$A:$H,7,0)/VLOOKUP(EDATE($C$8,-1),Índices!$A:$H,7,0)),\"\")","v":""},{"$f":"IFERROR(IF(B296=\"\",\"\",E296*(VLOOKUP(B296,Índices!$A:$H,8,0)-VLOOKUP(EDATE($C$8,-1),Índices!$A:$H,8,0))),\"\")","v":""},null,"vazia"]
[null,{"$f":"IFERROR(IF(EDATE($C$8,276)>$C$9,\"\",IF(EDATE($C$8,276)>DATE(2099,12,1),\"\",EDATE($C$8,276))),\"\")","v":""},{"$f":"IFERROR(IF(B297=\"\",\"\",VLOOKUP(B297,Índices!$A:$H,5,0)),\"\")","v":""},{"$f":"IFERROR(IF(B297=\"\",\"\",VLOOKUP(B297,Índices!$A:$H,6,0)),\"\")","v":""},{"$f":"IFERROR(IF(B297=\"\",\"\",$C$10*VLOOKUP(B297,Índices!$A:$H,7,0)/VLOOKUP(EDATE($C$8,-1),Índices!$A:$H,7,0)),\"\")","v":""},{"$f":"IFERROR(IF(B297=\"\",\"\",E297*(VLOOKUP(B297,Índices!$A:$H,8,0)-VLOOKUP(EDATE($C$8,-1),Índices!$A:$H,8,0))),\"\")","v":""},null,"vazia"]
[null,{"$f":"IFERROR(IF(EDATE($C$8,277)>$C$9,\"\",IF(EDATE($C$8,277)>DATE(2099,12,1),\"\",EDATE($C$8,277))),\"\")","v":""},{"$f":"IFERROR(IF(B298=\"\",\"\",VLOOKUP(B298,Índices!$A:$H,5,0)),\"\")","v":""},{"$f":"IFERROR(IF(B298=\"\",\"\",VLOOKUP(B298,Índices!$A:$H,6,0)),\"\")","v":""},{"$f":"IFERROR(IF(B298=\"\",\"\",$C$10*VLOOKUP(B298,Índices!$A:$H,7,0)/VLOOKUP(EDATE($C$8,-1),Índices!$A:$H,7,0)),\"\")","v":""},{"$f":"IFERROR(IF(B298=\"\",\"\",E298*(VLOOKUP(B298,Índices!$A:$H,8,0)-VLOOKUP(EDATE($C$8,-1),Índices!$A:$H,8,0))),\"\")","v":""},null,"vazia"]
[null,{"$f":"IFERROR(IF(EDATE($C$8,278)>$C$9,\"\",IF(EDATE($C$8,278)>DATE(2099,12,1),\"\",EDATE($C$8,278))),\"\")","v":""},{"$f":"IFERROR(IF(B299=\"\",\"\",VLOOKUP(B299,Índices!$A:$H,5,0)),\"\")","v":""},{"$f":"IFERROR(IF(B299=\"\",\"\",VLOOKUP(B299,Índices!$A:$H,6,0)),\"\")","v":""},{"$f":"IFERROR(IF(B299=\"\",\"\",$C$10*VLOOKUP(B299,Índices!$A:$H,7,0)/VLOOKUP(EDATE($C$8,-1),Índices!$A:$H,7,0)),\"\")","v":""},{"$f":"IFERROR(IF(B299=\"\",\"\",E299*(VLOOKUP(B299,Índices!$A:$H,8,0)-VLOOKUP(EDATE($C$8,-1),Índices!$A:$H,8,0))),\"\")","v":""},null,"vazia"]
[null,{"$f":"IFERROR(IF(EDATE($C$8,279)>$C$9,\"\",IF(EDATE($C$8,279)>DATE(2099,12,1),\"\",EDATE($C$8,279))),\"\")","v":""},{"$f":"IFERROR(IF(B300=\"\",\"\",VLOOKUP(B300,Índices!$A:$H,5,0)),\"\")","v":""},{"$f":"IFERROR(IF(B300=\"\",\"\",VLOOKUP(B300,Índices!$A:$H,6,0)),\"\")","v":""},{"$f":"IFERROR(IF(B300=\"\",\"\",$C$10*VLOOKUP(B300,Índices!$A:$H,7,0)/VLOOKUP(EDATE($C$8,-1),Índices!$A:$H,7,0)),\"\")","v":""},{"$f":"IFERROR(IF(B300=\"\",\"\",E300*(VLOOKUP(B300,Índices!$A:$H,8,0)-VLOOKUP(EDATE($C$8,-1),Índices!$A:$H,8,0))),\"\")","v":""},null,"vazia"]
[null,{"$f":"IFERROR(IF(EDATE($C$8,280)>$C$9,\"\",IF(EDATE($C$8,280)>DATE(2099,12,1),\"\",EDATE($C$8,280))),\"\")","v":""},{"$f":"IFERROR(IF(B301=\"\",\"\",VLOOKUP(B301,Índices!$A:$H,5,0)),\"\")","v":""},{"$f":"IFERROR(IF(B301=\"\",\"\",VLOOKUP(B301,Índices!$A:$H,6,0)),\"\")","v":""},{"$f":"IFERROR(IF(B301=\"\",\"\",$C$10*VLOOKUP(B301,Índices!$A:$H,7,0)/VLOOKUP(EDATE($C$8,-1),Índices!$A:$H,7,0)),\"\")","v":""},{"$f":"IFERROR(IF(B301=\"\",\"\",E301*(VLOOKUP(B301,Índices!$A:$H,8,0)-VLOOKUP(EDATE($C$8,-1),Índices!$A:$H,8,0))),\"\")","v":""},null,"vazia"]
[null,{"$f":"IFERROR(IF(EDATE($C$8,281)>$C$9,\"\",IF(EDATE($C$8,281)>DATE(2099,12,1),\"\",EDATE($C$8,281))),\"\")","v":""},{"$f":"IFERROR(IF(B302=\"\",\"\",VLOOKUP(B302,Índices!$A:$H,5,0)),\"\")","v":""},{"$f":"IFERROR(IF(B302=\"\",\"\",VLOOKUP(B302,Índices!$A:$H,6,0)),\"\")","v":""},{"$f":"IFERROR(IF(B302=\"\",\"\",$C$10*VLOOKUP(B302,Índices!$A:$H,7,0)/VLOOKUP(EDATE($C$8,-1),Índices!$A:$H,7,0)),\"\")","v":""},{"$f":"IFERROR(IF(B302=\"\",\"\",E302*(VLOOKUP(B302,Índices!$A:$H,8,0)-VLOOKUP(EDATE($C$8,-1),Índices!$A:$H,8,0))),\"\")","v":""},null,"vazia"]
[null,{"$f":"IFERROR(IF(EDATE($C$8,282)>$C$9,\"\",IF(EDATE($C$8,282)>DATE(2099,12,1),\"\",EDATE($C$8,282))),\"\")","v":""},{"$f":"IFERROR(IF(B303=\"\",\"\",VLOOKUP(B303,Índices!$A:$H,5,0)),\"\")","v":""},{"$f":"IFERROR(IF(B303=\"\",\"\",VLOOKUP(B303,Índices!$A:$H,6,0)),\"\")","v":""},{"$f":"IFERROR(IF(B303=\"\",\"\",$C$10*VLOOKUP(B303,Índices!$A:$H,7,0)/VLOOKUP(EDATE($C$8,-1),Índices!$A:$H,7,0)),\"\")","v":""},{"$f":"IFERROR(IF(B303=\"\",\"\",E303*(VLOOKUP(B303,Índices!$A:$H,8,0)-VLOOKUP(EDATE($C$8,-1),Índices!$A:$H,8,0))),\"\")","v":""},null,"vazia"]
[null,{"$f":"IFERROR(IF(EDATE($C$8,283)>$C$9,\"\",IF(EDATE($C$8,283)>DATE(2099,12,1),\"\",EDATE($C$8,283))),\"\")","v":""},{"$f":"IFERROR(IF(B304=\"\",\"\",VLOOKUP(B304,Índices!$A:$H,5,0)),\"\")","v":""},{"$f":"IFERROR(IF(B304=\"\",\"\",VLOOKUP(B304,Índices!$A:$H,6,0)),\"\")","v":""},{"$f":"IFERROR(IF(B304=\"\",\"\",$C$10*VLOOKUP(B304,Índices!$A:$H,7,0)/VLOOKUP(EDATE($C$8,-1),Índices!$A:$H,7,0)),\"\")","v":""},{"$f":"IFERROR(IF(B304=\"\",\"\",E304*(VLOOKUP(B304,Índices!$A:$H,8,0)-VLOOKUP(EDATE($C$8,-1),Índices!$A:$H,8,0))),\"\")","v":""},null,"vazia"]
[null,{"$f":"IFERROR(IF(EDATE($C$8,284)>$C$9,\"\",IF(EDATE($C$8,284)>DATE(2099,12,1),\"\",EDATE($C$8,284))),\"\")","v":""},{"$f":"IFERROR(IF(B305=\"\",\"\",VLOOKUP(B305,Índices!$A:$H,5,0)),\"\")","v":""},{"$f":"IFERROR(IF(B305=\"\",\"\",VLOOKUP(B305,Índices!$A:$H,6,0)),\"\")","v":""},{"$f":"IFERROR(IF(B305=\"\",\"\",$C$10*VLOOKUP(B305,Índices!$A:$H,7,0)/VLOOKUP(EDATE($C$8,-1),Índices!$A:$H,7,0)),\"\")","v":""},{"$f":"IFERROR(IF(B305=\"\",\"\",E305*(VLOOKUP(B305,Índices!$A:$H,8,0)-VLOOKUP(EDATE($C$8,-1),Índices!$A:$H,8,0))),\"\")","v":""},null,"vazia"]
[null,{"$f":"IFERROR(IF(EDATE($C$8,285)>$C$9,\"\",IF(EDATE($C$8,285)>DATE(2099,12,1),\"\",EDATE($C$8,285))),\"\")","v":""},{"$f":"IFERROR(IF(B306=\"\",\"\",VLOOKUP(B306,Índices!$A:$H,5,0)),\"\")","v":""},{"$f":"IFERROR(IF(B306=\"\",\"\",VLOOKUP(B306,Índices!$A:$H,6,0)),\"\")","v":""},{"$f":"IFERROR(IF(B306=\"\",\"\",$C$10*VLOOKUP(B306,Índices!$A:$H,7,0)/VLOOKUP(EDATE($C$8,-1),Índices!$A:$H,7,0)),\"\")","v":""},{"$f":"IFERROR(IF(B306=\"\",\"\",E306*(VLOOKUP(B306,Índices!$A:$H,8,0)-VLOOKUP(EDATE($C$8,-1),Índices!$A:$H,8,0))),\"\")","v":""},null,"vazia"]
[null,{"$f":"IFERROR(IF(EDATE($C$8,286)>$C$9,\"\",IF(EDATE($C$8,286)>DATE(2099,12,1),\"\",EDATE($C$8,286))),\"\")","v":""},{"$f":"IFERROR(IF(B307=\"\",\"\",VLOOKUP(B307,Índices!$A:$H,5,0)),\"\")","v":""},{"$f":"IFERROR(IF(B307=\"\",\"\",VLOOKUP(B307,Índices!$A:$H,6,0)),\"\")","v":""},{"$f":"IFERROR(IF(B307=\"\",\"\",$C$10*VLOOKUP(B307,Índices!$A:$H,7,0)/VLOOKUP(EDATE($C$8,-1),Índices!$A:$H,7,0)),\"\")","v":""},{"$f":"IFERROR(IF(B307=\"\",\"\",E307*(VLOOKUP(B307,Índices!$A:$H,8,0)-VLOOKUP(EDATE($C$8,-1),Índices!$A:$H,8,0))),\"\")","v":""},null,"vazia"]
[null,{"$f":"IFERROR(IF(EDATE($C$8,287)>$C$9,\"\",IF(EDATE($C$8,287)>DATE(2099,12,1),\"\",EDATE($C$8,287))),\"\")","v":""},{"$f":"IFERROR(IF(B308=\"\",\"\",VLOOKUP(B308,Índices!$A:$H,5,0)),\"\")","v":""},{"$f":"IFERROR(IF(B308=\"\",\"\",VLOOKUP(B308,Índices!$A:$H,6,0)),\"\")","v":""},{"$f":"IFERROR(IF(B308=\"\",\"\",$C$10*VLOOKUP(B308,Índices!$A:$H,7,0)/VLOOKUP(EDATE($C$8,-1),Índices!$A:$H,7,0)),\"\")","v":""},{"$f":"IFERROR(IF(B308=\"\",\"\",E308*(VLOOKUP(B308,Índices!$A:$H,8,0)-VLOOKUP(EDATE($C$8,-1),Índices!$A:$H,8,0))),\"\")","v":""},null,"vazia"]
[null,{"$f":"IFERROR(IF(EDATE($C$8,288)>$C$9,\"\",IF(EDATE($C$8,288)>DATE(2099,12,1),\"\",EDATE($C$8,288))),\"\")","v":""},{"$f":"IFERROR(IF(B309=\"\",\"\",VLOOKUP(B309,Índices!$A:$H,5,0)),\"\")","v":""},{"$f":"IFERROR(IF(B309=\"\",\"\",VLOOKUP(B309,Índices!$A:$H,6,0)),\"\")","v":""},{"$f":"IFERROR(IF(B309=\"\",\"\",$C$10*VLOOKUP(B309,Índices!$A:$H,7,0)/VLOOKUP(EDATE($C$8,-1),Índices!$A:$H,7,0)),\"\")","v":""},{"$f":"IFERROR(IF(B309=\"\",\"\",E309*(VLOOKUP(B309,Índices!$A:$H,8,0)-VLOOKUP(EDATE($C$8,-1),Índices!$A:$H,8,0))),\"\")","v":""},null,"vazia"]
[null,{"$f":"IFERROR(IF(EDATE($C$8,289)>$C$9,\"\",IF(EDATE($C$8,289)>DATE(2099,12,1),\"\",EDATE($C$8,289))),\"\")","v":""},{"$f":"IFERROR(IF(B310=\"\",\"\",VLOOKUP(B310,Índices!$A:$H,5,0)),\"\")","v":""},{"$f":"IFERROR(IF(B310=\"\",\"\",VLOOKUP(B310,Índices!$A:$H,6,0)),\"\")","v":""},{"$f":"IFERROR(IF(B310=\"\",\"\",$C$10*VLOOKUP(B310,Índices!$A:$H,7,0)/VLOOKUP(EDATE($C$8,-1),Índices!$A:$H,7,0)),\"\")","v":""},{"$f":"IFERROR(IF(B310=\"\",\"\",E310*(VLOOKUP(B310,Índices!$A:$H,8,0)-VLOOKUP(EDATE($C$8,-1),Índices!$A:$H,8,0))),\"\")","v":""},null,"vazia"]
[null,{"$f":"IFERROR(IF(EDATE($C$8,290)>$C$9,\"\",IF(EDATE($C$8,290)>DATE(2099,12,1),\"\",EDATE($C$8,290))),\"\")","v":""},{"$f":"IFERROR(IF(B311=\"\",\"\",VLOOKUP(B311,Índices!$A:$H,5,0)),\"\")","v":""},{"$f":"IFERROR(IF(B311=\"\",\"\",VLOOKUP(B311,Índices!$A:$H,6,0)),\"\")","v":""},{"$f":"IFERROR(IF(B311=\"\",\"\",$C$10*VLOOKUP(B311,Índices!$A:$H,7,0)/VLOOKUP(EDATE($C$8,-1),Índices!$A:$H,7,0)),\"\")","v":""},{"$f":"IFERROR(IF(B311=\"\",\"\",E311*(VLOOKUP(B311,Índices!$A:$H,8,0)-VLOOKUP(EDATE($C$8,-1),Índices!$A:$H,8,0))),\"\")","v":""},null,"vazia"]
[null,{"$f":"IFERROR(IF(EDATE($C$8,291)>$C$9,\"\",IF(EDATE($C$8,291)>DATE(2099,12,1),\"\",EDATE($C$8,291))),\"\")","v":""},{"$f":"IFERROR(IF(B312=\"\",\"\",VLOOKUP(B312,Índices!$A:$H,5,0)),\"\")","v":""},{"$f":"IFERROR(IF(B312=\"\",\"\",VLOOKUP(B312,Índices!$A:$H,6,0)),\"\")","v":""},{"$f":"IFERROR(IF(B312=\"\",\"\",$C$10*VLOOKUP(B312,Índices!$A:$H,7,0)/VLOOKUP(EDATE($C$8,-1),Índices!$A:$H,7,0)),\"\")","v":""},{"$f":"IFERROR(IF(B312=\"\",\"\",E312*(VLOOKUP(B312,Índices!$A:$H,8,0)-VLOOKUP(EDATE($C$8,-1),Índices!$A:$H,8,0))),\"\")","v":""},null,"vazia"]
[null,{"$f":"IFERROR(IF(EDATE($C$8,292)>$C$9,\"\",IF(EDATE($C$8,292)>DATE(2099,12,1),\"\",EDATE($C$8,292))),\"\")","v":""},{"$f":"IFERROR(IF(B313=\"\",\"\",VLOOKUP(B313,Índices!$A:$H,5,0)),\"\")","v":""},{"$f":"IFERROR(IF(B313=\"\",\"\",VLOOKUP(B313,Índices!$A:$H,6,0)),\"\")","v":""},{"$f":"IFERROR(IF(B313=\"\",\"\",$C$10*VLOOKUP(B313,Índices!$A:$H,7,0)/VLOOKUP(EDATE($C$8,-1),Índices!$A:$H,7,0)),\"\")","v":""},{"$f":"IFERROR(IF(B313=\"\",\"\",E313*(VLOOKUP(B313,Índices!$A:$H,8,0)-VLOOKUP(EDATE($C$8,-1),Índices!$A:$H,8,0))),\"\")","v":""},null,"vazia"]
[null,{"$f":"IFERROR(IF(EDATE($C$8,293)>$C$9,\"\",IF(EDATE($C$8,293)>DATE(2099,12,1),\"\",EDATE($C$8,293))),\"\")","v":""},{"$f":"IFERROR(IF(B314=\"\",\"\",VLOOKUP(B314,Índices!$A:$H,5,0)),\"\")","v":""},{"$f":"IFERROR(IF(B314=\"\",\"\",VLOOKUP(B314,Índices!$A:$H,6,0)),\"\")","v":""},{"$f":"IFERROR(IF(B314=\"\",\"\",$C$10*VLOOKUP(B314,Índices!$A:$H,7,0)/VLOOKUP(EDATE($C$8,-1),Índices!$A:$H,7,0)),\"\")","v":""},{"$f":"IFERROR(IF(B314=\"\",\"\",E314*(VLOOKUP(B314,Índices!$A:$H,8,0)-VLOOKUP(EDATE($C$8,-1),Índices!$A:$H,8,0))),\"\")","v":""},null,"vazia"]
[null,{"$f":"IFERROR(IF(EDATE($C$8,294)>$C$9,\"\",IF(EDATE($C$8,294)>DATE(2099,12,1),\"\",EDATE($C$8,294))),\"\")","v":""},{"$f":"IFERROR(IF(B315=\"\",\"\",VLOOKUP(B315,Índices!$A:$H,5,0)),\"\")","v":""},{"$f":"IFERROR(IF(B315=\"\",\"\",VLOOKUP(B315,Índices!$A:$H,6,0)),\"\")","v":""},{"$f":"IFERROR(IF(B315=\"\",\"\",$C$10*VLOOKUP(B315,Índices!$A:$H,7,0)/VLOOKUP(EDATE($C$8,-1),Índices!$A:$H,7,0)),\"\")","v":""},{"$f":"IFERROR(IF(B315=\"\",\"\",E315*(VLOOKUP(B315,Índices!$A:$H,8,0)-VLOOKUP(EDATE($C$8,-1),Índices!$A:$H,8,0))),\"\")","v":""},null,"vazia"]
[null,{"$f":"IFERROR(IF(EDATE($C$8,295)>$C$9,\"\",IF(EDATE($C$8,295)>DATE(2099,12,1),\"\",EDATE($C$8,295))),\"\")","v":""},{"$f":"IFERROR(IF(B316=\"\",\"\",VLOOKUP(B316,Índices!$A:$H,5,0)),\"\")","v":""},{"$f":"IFERROR(IF(B316=\"\",\"\",VLOOKUP(B316,Índices!$A:$H,6,0)),\"\")","v":""},{"$f":"IFERROR(IF(B316=\"\",\"\",$C$10*VLOOKUP(B316,Índices!$A:$H,7,0)/VLOOKUP(EDATE($C$8,-1),Índices!$A:$H,7,0)),\"\")","v":""},{"$f":"IFERROR(IF(B316=\"\",\"\",E316*(VLOOKUP(B316,Índices!$A:$H,8,0)-VLOOKUP(EDATE($C$8,-1),Índices!$A:$H,8,0))),\"\")","v":""},null,"vazia"]
[null,{"$f":"IFERROR(IF(EDATE($C$8,296)>$C$9,\"\",IF(EDATE($C$8,296)>DATE(2099,12,1),\"\",EDATE($C$8,296))),\"\")","v":""},{"$f":"IFERROR(IF(B317=\"\",\"\",VLOOKUP(B317,Índices!$A:$H,5,0)),\"\")","v":""},{"$f":"IFERROR(IF(B317=\"\",\"\",VLOOKUP(B317,Índices!$A:$H,6,0)),\"\")","v":""},{"$f":"IFERROR(IF(B317=\"\",\"\",$C$10*VLOOKUP(B317,Índices!$A:$H,7,0)/VLOOKUP(EDATE($C$8,-1),Índices!$A:$H,7,0)),\"\")","v":""},{"$f":"IFERROR(IF(B317=\"\",\"\",E317*(VLOOKUP(B317,Índices!$A:$H,8,0)-VLOOKUP(EDATE($C$8,-1),Índices!$A:$H,8,0))),\"\")","v":""},null,"vazia"]
[null,{"$f":"IFERROR(IF(EDATE($C$8,297)>$C$9,\"\",IF(EDATE($C$8,297)>DATE(2099,12,1),\"\",EDATE($C$8,297))),\"\")","v":""},{"$f":"IFERROR(IF(B318=\"\",\"\",VLOOKUP(B318,Índices!$A:$H,5,0)),\"\")","v":""},{"$f":"IFERROR(IF(B318=\"\",\"\",VLOOKUP(B318,Índices!$A:$H,6,0)),\"\")","v":""},{"$f":"IFERROR(IF(B318=\"\",\"\",$C$10*VLOOKUP(B318,Índices!$A:$H,7,0)/VLOOKUP(EDATE($C$8,-1),Índices!$A:$H,7,0)),\"\")","v":""},{"$f":"IFERROR(IF(B318=\"\",\"\",E318*(VLOOKUP(B318,Índices!$A:$H,8,0)-VLOOKUP(EDATE($C$8,-1),Índices!$A:$H,8,0))),\"\")","v":""},null,"vazia"]
[null,{"$f":"IFERROR(IF(EDATE($C$8,298)>$C$9,\"\",IF(EDATE($C$8,298)>DATE(2099,12,1),\"\",EDATE($C$8,298))),\"\")","v":""},{"$f":"IFERROR(IF(B319=\"\",\"\",VLOOKUP(B319,Índices!$A:$H,5,0)),\"\")","v":""},{"$f":"IFERROR(IF(B319=\"\",\"\",VLOOKUP(B319,Índices!$A:$H,6,0)),\"\")","v":""},{"$f":"IFERROR(IF(B319=\"\",\"\",$C$10*VLOOKUP(B319,Índices!$A:$H,7,0)/VLOOKUP(EDATE($C$8,-1),Índices!$A:$H,7,0)),\"\")","v":""},{"$f":"IFERROR(IF(B319=\"\",\"\",E319*(VLOOKUP(B319,Índices!$A:$H,8,0)-VLOOKUP(EDATE($C$8,-1),Índices!$A:$H,8,0))),\"\")","v":""},null,"vazia"]
[null,{"$f":"IFERROR(IF(EDATE($C$8,299)>$C$9,\"\",IF(EDATE($C$8,299)>DATE(2099,12,1),\"\",EDATE($C$8,299))),\"\")","v":""},{"$f":"IFERROR(IF(B320=\"\",\"\",VLOOKUP(B320,Índices!$A:$H,5,0)),\"\")","v":""},{"$f":"IFERROR(IF(B320=\"\",\"\",VLOOKUP(B320,Índices!$A:$H,6,0)),\"\")","v":""},{"$f":"IFERROR(IF(B320=\"\",\"\",$C$10*VLOOKUP(B320,Índices!$A:$H,7,0)/VLOOKUP(EDATE($C$8,-1),Índices!$A:$H,7,0)),\"\")","v":""},{"$f":"IFERROR(IF(B320=\"\",\"\",E320*(VLOOKUP(B320,Índices!$A:$H,8,0)-VLOOKUP(EDATE($C$8,-1),Índices!$A:$H,8,0))),\"\")","v":""},null,"vazia"]
[null,{"$f":"IFERROR(IF(EDATE($C$8,300)>$C$9,\"\",IF(EDATE($C$8,300)>DATE(2099,12,1),\"\",EDATE($C$8,300))),\"\")","v":""},{"$f":"IFERROR(IF(B321=\"\",\"\",VLOOKUP(B321,Índices!$A:$H,5,0)),\"\")","v":""},{"$f":"IFERROR(IF(B321=\"\",\"\",VLOOKUP(B321,Índices!$A:$H,6,0)),\"\")","v":""},{"$f":"IFERROR(IF(B321=\"\",\"\",$C$10*VLOOKUP(B321,Índices!$A:$H,7,0)/VLOOKUP(EDATE($C$8,-1),Índices!$A:$H,7,0)),\"\")","v":""},{"$f":"IFERROR(IF(B321=\"\",\"\",E321*(VLOOKUP(B321,Índices!$A:$H,8,0)-VLOOKUP(EDATE($C$8,-1),Índices!$A:$H,8,0))),\"\")","v":""},null,"vazia"]
[null,{"$f":"IFERROR(IF(EDATE($C$8,301)>$C$9,\"\",IF(EDATE($C$8,301)>DATE(2099,12,1),\"\",EDATE($C$8,301))),\"\")","v":""},{"$f":"IFERROR(IF(B322=\"\",\"\",VLOOKUP(B322,Índices!$A:$H,5,0)),\"\")","v":""},{"$f":"IFERROR(IF(B322=\"\",\"\",VLOOKUP(B322,Índices!$A:$H,6,0)),\"\")","v":""},{"$f":"IFERROR(IF(B322=\"\",\"\",$C$10*VLOOKUP(B322,Índices!$A:$H,7,0)/VLOOKUP(EDATE($C$8,-1),Índices!$A:$H,7,0)),\"\")","v":""},{"$f":"IFERROR(IF(B322=\"\",\"\",E322*(VLOOKUP(B322,Índices!$A:$H,8,0)-VLOOKUP(EDATE($C$8,-1),Índices!$A:$H,8,0))),\"\")","v":""},null,"vazia"]
[null,{"$f":"IFERROR(IF(EDATE($C$8,302)>$C$9,\"\",IF(EDATE($C$8,302)>DATE(2099,12,1),\"\",EDATE($C$8,302))),\"\")","v":""},{"$f":"IFERROR(IF(B323=\"\",\"\",VLOOKUP(B323,Índices!$A:$H,5,0)),\"\")","v":""},{"$f":"IFERROR(IF(B323=\"\",\"\",VLOOKUP(B323,Índices!$A:$H,6,0)),\"\")","v":""},{"$f":"IFERROR(IF(B323=\"\",\"\",$C$10*VLOOKUP(B323,Índices!$A:$H,7,0)/VLOOKUP(EDATE($C$8,-1),Índices!$A:$H,7,0)),\"\")","v":""},{"$f":"IFERROR(IF(B323=\"\",\"\",E323*(VLOOKUP(B323,Índices!$A:$H,8,0)-VLOOKUP(EDATE($C$8,-1),Índices!$A:$H,8,0))),\"\")","v":""},null,"vazia"]
[null,{"$f":"IFERROR(IF(EDATE($C$8,303)>$C$9,\"\",IF(EDATE($C$8,303)>DATE(2099,12,1),\"\",EDATE($C$8,303))),\"\")","v":""},{"$f":"IFERROR(IF(B324=\"\",\"\",VLOOKUP(B324,Índices!$A:$H,5,0)),\"\")","v":""},{"$f":"IFERROR(IF(B324=\"\",\"\",VLOOKUP(B324,Índices!$A:$H,6,0)),\"\")","v":""},{"$f":"IFERROR(IF(B324=\"\",\"\",$C$10*VLOOKUP(B324,Índices!$A:$H,7,0)/VLOOKUP(EDATE($C$8,-1),Índices!$A:$H,7,0)),\"\")","v":""},{"$f":"IFERROR(IF(B324=\"\",\"\",E324*(VLOOKUP(B324,Índices!$A:$H,8,0)-VLOOKUP(EDATE($C$8,-1),Índices!$A:$H,8,0))),\"\")","v":""},null,"vazia"]
[null,{"$f":"IFERROR(IF(EDATE($C$8,304)>$C$9,\"\",IF(EDATE($C$8,304)>DATE(2099,12,1),\"\",EDATE($C$8,304))),\"\")","v":""},{"$f":"IFERROR(IF(B325=\"\",\"\",VLOOKUP(B325,Índices!$A:$H,5,0)),\"\")","v":""},{"$f":"IFERROR(IF(B325=\"\",\"\",VLOOKUP(B325,Índices!$A:$H,6,0)),\"\")","v":""},{"$f":"IFERROR(IF(B325=\"\",\"\",$C$10*VLOOKUP(B325,Índices!$A:$H,7,0)/VLOOKUP(EDATE($C$8,-1),Índices!$A:$H,7,0)),\"\")","v":""},{"$f":"IFERROR(IF(B325=\"\",\"\",E325*(VLOOKUP(B325,Índices!$A:$H,8,0)-VLOOKUP(EDATE($C$8,-1),Índices!$A:$H,8,0))),\"\")","v":""},null,"vazia"]
[null,{"$f":"IFERROR(IF(EDATE($C$8,305)>$C$9,\"\",IF(EDATE($C$8,305)>DATE(2099,12,1),\"\",EDATE($C$8,305))),\"\")","v":""},{"$f":"IFERROR(IF(B326=\"\",\"\",VLOOKUP(B326,Índices!$A:$H,5,0)),\"\")","v":""},{"$f":"IFERROR(IF(B326=\"\",\"\",VLOOKUP(B326,Índices!$A:$H,6,0)),\"\")","v":""},{"$f":"IFERROR(IF(B326=\"\",\"\",$C$10*VLOOKUP(B326,Índices!$A:$H,7,0)/VLOOKUP(EDATE($C$8,-1),Índices!$A:$H,7,0)),\"\")","v":""},{"$f":"IFERROR(IF(B326=\"\",\"\",E326*(VLOOKUP(B326,Índices!$A:$H,8,0)-VLOOKUP(EDATE($C$8,-1),Índices!$A:$H,8,0))),\"\")","v":""},null,"vazia"]
[null,{"$f":"IFERROR(IF(EDATE($C$8,306)>$C$9,\"\",IF(EDATE($C$8,306)>DATE(2099,12,1),\"\",EDATE($C$8,306))),\"\")","v":""},{"$f":"IFERROR(IF(B327=\"\",\"\",VLOOKUP(B327,Índices!$A:$H,5,0)),\"\")","v":""},{"$f":"IFERROR(IF(B327=\"\",\"\",VLOOKUP(B327,Índices!$A:$H,6,0)),\"\")","v":""},{"$f":"IFERROR(IF(B327=\"\",\"\",$C$10*VLOOKUP(B327,Índices!$A:$H,7,0)/VLOOKUP(EDATE($C$8,-1),Índices!$A:$H,7,0)),\"\")","v":""},{"$f":"IFERROR(IF(B327=\"\",\"\",E327*(VLOOKUP(B327,Índices!$A:$H,8,0)-VLOOKUP(EDATE($C$8,-1),Índices!$A:$H,8,0))),\"\")","v":""},null,"vazia"]
[null,{"$f":"IFERROR(IF(EDATE($C$8,307)>$C$9,\"\",IF(EDATE($C$8,307)>DATE(2099,12,1),\"\",EDATE($C$8,307))),\"\")","v":""},{"$f":"IFERROR(IF(B328=\"\",\"\",VLOOKUP(B328,Índices!$A:$H,5,0)),\"\")","v":""},{"$f":"IFERROR(IF(B328=\"\",\"\",VLOOKUP(B328,Índices!$A:$H,6,0)),\"\")","v":""},{"$f":"IFERROR(IF(B328=\"\",\"\",$C$10*VLOOKUP(B328,Índices!$A:$H,7,0)/VLOOKUP(EDATE($C$8,-1),Índices!$A:$H,7,0)),\"\")","v":""},{"$f":"IFERROR(IF(B328=\"\",\"\",E328*(VLOOKUP(B328,Índices!$A:$H,8,0)-VLOOKUP(EDATE($C$8,-1),Índices!$A:$H,8,0))),\"\")","v":""},null,"vazia"]
[null,{"$f":"IFERROR(IF(EDATE($C$8,308)>$C$9,\"\",IF(EDATE($C$8,308)>DATE(2099,12,1),\"\",EDATE($C$8,308))),\"\")","v":""},{"$f":"IFERROR(IF(B329=\"\",\"\",VLOOKUP(B329,Índices!$A:$H,5,0)),\"\")","v":""},{"$f":"IFERROR(IF(B329=\"\",\"\",VLOOKUP(B329,Índices!$A:$H,6,0)),\"\")","v":""},{"$f":"IFERROR(IF(B329=\"\",\"\",$C$10*VLOOKUP(B329,Índices!$A:$H,7,0)/VLOOKUP(EDATE($C$8,-1),Índices!$A:$H,7,0)),\"\")","v":""},{"$f":"IFERROR(IF(B329=\"\",\"\",E329*(VLOOKUP(B329,Índices!$A:$H,8,0)-VLOOKUP(EDATE($C$8,-1),Índices!$A:$H,8,0))),\"\")","v":""},null,"vazia"]
[null,{"$f":"IFERROR(IF(EDATE($C$8,309)>$C$9,\"\",IF(EDATE($C$8,309)>DATE(2099,12,1),\"\",EDATE($C$8,309))),\"\")","v":""},{"$f":"IFERROR(IF(B330=\"\",\"\",VLOOKUP(B330,Índices!$A:$H,5,0)),\"\")","v":""},{"$f":"IFERROR(IF(B330=\"\",\"\",VLOOKUP(B330,Índices!$A:$H,6,0)),\"\")","v":""},{"$f":"IFERROR(IF(B330=\"\",\"\",$C$10*VLOOKUP(B330,Índices!$A:$H,7,0)/VLOOKUP(EDATE($C$8,-1),Índices!$A:$H,7,0)),\"\")","v":""},{"$f":"IFERROR(IF(B330=\"\",\"\",E330*(VLOOKUP(B330,Índices!$A:$H,8,0)-VLOOKUP(EDATE($C$8,-1),Índices!$A:$H,8,0))),\"\")","v":""},null,"vazia"]
[null,{"$f":"IFERROR(IF(EDATE($C$8,310)>$C$9,\"\",IF(EDATE($C$8,310)>DATE(2099,12,1),\"\",EDATE($C$8,310))),\"\")","v":""},{"$f":"IFERROR(IF(B331=\"\",\"\",VLOOKUP(B331,Índices!$A:$H,5,0)),\"\")","v":""},{"$f":"IFERROR(IF(B331=\"\",\"\",VLOOKUP(B331,Índices!$A:$H,6,0)),\"\")","v":""},{"$f":"IFERROR(IF(B331=\"\",\"\",$C$10*VLOOKUP(B331,Índices!$A:$H,7,0)/VLOOKUP(EDATE($C$8,-1),Índices!$A:$H,7,0)),\"\")","v":""},{"$f":"IFERROR(IF(B331=\"\",\"\",E331*(VLOOKUP(B331,Índices!$A:$H,8,0)-VLOOKUP(EDATE($C$8,-1),Índices!$A:$H,8,0))),\"\")","v":""},null,"vazia"]
[null,{"$f":"IFERROR(IF(EDATE($C$8,311)>$C$9,\"\",IF(EDATE($C$8,311)>DATE(2099,12,1),\"\",EDATE($C$8,311))),\"\")","v":""},{"$f":"IFERROR(IF(B332=\"\",\"\",VLOOKUP(B332,Índices!$A:$H,5,0)),\"\")","v":""},{"$f":"IFERROR(IF(B332=\"\",\"\",VLOOKUP(B332,Índices!$A:$H,6,0)),\"\")","v":""},{"$f":"IFERROR(IF(B332=\"\",\"\",$C$10*VLOOKUP(B332,Índices!$A:$H,7,0)/VLOOKUP(EDATE($C$8,-1),Índices!$A:$H,7,0)),\"\")","v":""},{"$f":"IFERROR(IF(B332=\"\",\"\",E332*(VLOOKUP(B332,Índices!$A:$H,8,0)-VLOOKUP(EDATE($C$8,-1),Índices!$A:$H,8,0))),\"\")","v":""},null,"vazia"]
[null,{"$f":"IFERROR(IF(EDATE($C$8,312)>$C$9,\"\",IF(EDATE($C$8,312)>DATE(2099,12,1),\"\",EDATE($C$8,312))),\"\")","v":""},{"$f":"IFERROR(IF(B333=\"\",\"\",VLOOKUP(B333,Índices!$A:$H,5,0)),\"\")","v":""},{"$f":"IFERROR(IF(B333=\"\",\"\",VLOOKUP(B333,Índices!$A:$H,6,0)),\"\")","v":""},{"$f":"IFERROR(IF(B333=\"\",\"\",$C$10*VLOOKUP(B333,Índices!$A:$H,7,0)/VLOOKUP(EDATE($C$8,-1),Índices!$A:$H,7,0)),\"\")","v":""},{"$f":"IFERROR(IF(B333=\"\",\"\",E333*(VLOOKUP(B333,Índices!$A:$H,8,0)-VLOOKUP(EDATE($C$8,-1),Índices!$A:$H,8,0))),\"\")","v":""},null,"vazia"]
[null,{"$f":"IFERROR(IF(EDATE($C$8,313)>$C$9,\"\",IF(EDATE($C$8,313)>DATE(2099,12,1),\"\",EDATE($C$8,313))),\"\")","v":""},{"$f":"IFERROR(IF(B334=\"\",\"\",VLOOKUP(B334,Índices!$A:$H,5,0)),\"\")","v":""},{"$f":"IFERROR(IF(B334=\"\",\"\",VLOOKUP(B334,Índices!$A:$H,6,0)),\"\")","v":""},{"$f":"IFERROR(IF(B334=\"\",\"\",$C$10*VLOOKUP(B334,Índices!$A:$H,7,0)/VLOOKUP(EDATE($C$8,-1),Índices!$A:$H,7,0)),\"\")","v":""},{"$f":"IFERROR(IF(B334=\"\",\"\",E334*(VLOOKUP(B334,Índices!$A:$H,8,0)-VLOOKUP(EDATE($C$8,-1),Índices!$A:$H,8,0))),\"\")","v":""},null,"vazia"]
[null,{"$f":"IFERROR(IF(EDATE($C$8,314)>$C$9,\"\",IF(EDATE($C$8,314)>DATE(2099,12,1),\"\",EDATE($C$8,314))),\"\")","v":""},{"$f":"IFERROR(IF(B335=\"\",\"\",VLOOKUP(B335,Índices!$A:$H,5,0)),\"\")","v":""},{"$f":"IFERROR(IF(B335=\"\",\"\",VLOOKUP(B335,Índices!$A:$H,6,0)),\"\")","v":""},{"$f":"IFERROR(IF(B335=\"\",\"\",$C$10*VLOOKUP(B335,Índices!$A:$H,7,0)/VLOOKUP(EDATE($C$8,-1),Índices!$A:$H,7,0)),\"\")","v":""},{"$f":"IFERROR(IF(B335=\"\",\"\",E335*(VLOOKUP(B335,Índices!$A:$H,8,0)-VLOOKUP(EDATE($C$8,-1),Índices!$A:$H,8,0))),\"\")","v":""},null,"vazia"]
[null,{"$f":"IFERROR(IF(EDATE($C$8,315)>$C$9,\"\",IF(EDATE($C$8,315)>DATE(2099,12,1),\"\",EDATE($C$8,315))),\"\")","v":""},{"$f":"IFERROR(IF(B336=\"\",\"\",VLOOKUP(B336,Índices!$A:$H,5,0)),\"\")","v":""},{"$f":"IFERROR(IF(B336=\"\",\"\",VLOOKUP(B336,Índices!$A:$H,6,0)),\"\")","v":""},{"$f":"IFERROR(IF(B336=\"\",\"\",$C$10*VLOOKUP(B336,Índices!$A:$H,7,0)/VLOOKUP(EDATE($C$8,-1),Índices!$A:$H,7,0)),\"\")","v":""},{"$f":"IFERROR(IF(B336=\"\",\"\",E336*(VLOOKUP(B336,Índices!$A:$H,8,0)-VLOOKUP(EDATE($C$8,-1),Índices!$A:$H,8,0))),\"\")","v":""},null,"vazia"]
[null,{"$f":"IFERROR(IF(EDATE($C$8,316)>$C$9,\"\",IF(EDATE($C$8,316)>DATE(2099,12,1),\"\",EDATE($C$8,316))),\"\")","v":""},{"$f":"IFERROR(IF(B337=\"\",\"\",VLOOKUP(B337,Índices!$A:$H,5,0)),\"\")","v":""},{"$f":"IFERROR(IF(B337=\"\",\"\",VLOOKUP(B337,Índices!$A:$H,6,0)),\"\")","v":""},{"$f":"IFERROR(IF(B337=\"\",\"\",$C$10*VLOOKUP(B337,Índices!$A:$H,7,0)/VLOOKUP(EDATE($C$8,-1),Índices!$A:$H,7,0)),\"\")","v":""},{"$f":"IFERROR(IF(B337=\"\",\"\",E337*(VLOOKUP(B337,Índices!$A:$H,8,0)-VLOOKUP(EDATE($C$8,-1),Índices!$A:$H,8,0))),\"\")","v":""},null,"vazia"]
[null,{"$f":"IFERROR(IF(EDATE($C$8,317)>$C$9,\"\",IF(EDATE($C$8,317)>DATE(2099,12,1),\"\",EDATE($C$8,317))),\"\")","v":""},{"$f":"IFERROR(IF(B338=\"\",\"\",VLOOKUP(B338,Índices!$A:$H,5,0)),\"\")","v":""},{"$f":"IFERROR(IF(B338=\"\",\"\",VLOOKUP(B338,Índices!$A:$H,6,0)),\"\")","v":""},{"$f":"IFERROR(IF(B338=\"\",\"\",$C$10*VLOOKUP(B338,Índices!$A:$H,7,0)/VLOOKUP(EDATE($C$8,-1),Índices!$A:$H,7,0)),\"\")","v":""},{"$f":"IFERROR(IF(B338=\"\",\"\",E338*(VLOOKUP(B338,Índices!$A:$H,8,0)-VLOOKUP(EDATE($C$8,-1),Índices!$A:$H,8,0))),\"\")","v":""},null,"vazia"]
[null,{"$f":"IFERROR(IF(EDATE($C$8,318)>$C$9,\"\",IF(EDATE($C$8,318)>DATE(2099,12,1),\"\",EDATE($C$8,318))),\"\")","v":""},{"$f":"IFERROR(IF(B339=\"\",\"\",VLOOKUP(B339,Índices!$A:$H,5,0)),\"\")","v":""},{"$f":"IFERROR(IF(B339=\"\",\"\",VLOOKUP(B339,Índices!$A:$H,6,0)),\"\")","v":""},{"$f":"IFERROR(IF(B339=\"\",\"\",$C$10*VLOOKUP(B339,Índices!$A:$H,7,0)/VLOOKUP(EDATE($C$8,-1),Índices!$A:$H,7,0)),\"\")","v":""},{"$f":"IFERROR(IF(B339=\"\",\"\",E339*(VLOOKUP(B339,Índices!$A:$H,8,0)-VLOOKUP(EDATE($C$8,-1),Índices!$A:$H,8,0))),\"\")","v":""},null,"vazia"]
[null,{"$f":"IFERROR(IF(EDATE($C$8,319)>$C$9,\"\",IF(EDATE($C$8,319)>DATE(2099,12,1),\"\",EDATE($C$8,319))),\"\")","v":""},{"$f":"IFERROR(IF(B340=\"\",\"\",VLOOKUP(B340,Índices!$A:$H,5,0)),\"\")","v":""},{"$f":"IFERROR(IF(B340=\"\",\"\",VLOOKUP(B340,Índices!$A:$H,6,0)),\"\")","v":""},{"$f":"IFERROR(IF(B340=\"\",\"\",$C$10*VLOOKUP(B340,Índices!$A:$H,7,0)/VLOOKUP(EDATE($C$8,-1),Índices!$A:$H,7,0)),\"\")","v":""},{"$f":"IFERROR(IF(B340=\"\",\"\",E340*(VLOOKUP(B340,Índices!$A:$H,8,0)-VLOOKUP(EDATE($C$8,-1),Índices!$A:$H,8,0))),\"\")","v":""},null,"vazia"]
[null,{"$f":"IFERROR(IF(EDATE($C$8,320)>$C$9,\"\",IF(EDATE($C$8,320)>DATE(2099,12,1),\"\",EDATE($C$8,320))),\"\")","v":""},{"$f":"IFERROR(IF(B341=\"\",\"\",VLOOKUP(B341,Índices!$A:$H,5,0)),\"\")","v":""},{"$f":"IFERROR(IF(B341=\"\",\"\",VLOOKUP(B341,Índices!$A:$H,6,0)),\"\")","v":""},{"$f":"IFERROR(IF(B341=\"\",\"\",$C$10*VLOOKUP(B341,Índices!$A:$H,7,0)/VLOOKUP(EDATE($C$8,-1),Índices!$A:$H,7,0)),\"\")","v":""},{"$f":"IFERROR(IF(B341=\"\",\"\",E341*(VLOOKUP(B341,Índices!$A:$H,8,0)-VLOOKUP(EDATE($C$8,-1),Índices!$A:$H,8,0))),\"\")","v":""},null,"vazia"]
[null,{"$f":"IFERROR(IF(EDATE($C$8,321)>$C$9,\"\",IF(EDATE($C$8,321)>DATE(2099,12,1),\"\",EDATE($C$8,321))),\"\")","v":""},{"$f":"IFERROR(IF(B342=\"\",\"\",VLOOKUP(B342,Índices!$A:$H,5,0)),\"\")","v":""},{"$f":"IFERROR(IF(B342=\"\",\"\",VLOOKUP(B342,Índices!$A:$H,6,0)),\"\")","v":""},{"$f":"IFERROR(IF(B342=\"\",\"\",$C$10*VLOOKUP(B342,Índices!$A:$H,7,0)/VLOOKUP(EDATE($C$8,-1),Índices!$A:$H,7,0)),\"\")","v":""},{"$f":"IFERROR(IF(B342=\"\",\"\",E342*(VLOOKUP(B342,Índices!$A:$H,8,0)-VLOOKUP(EDATE($C$8,-1),Índices!$A:$H,8,0))),\"\")","v":""},null,{"$f":"IF(B342=\"\",\"vazia\",\"1\")","v":"vazia"}]
[null,{"$f":"IFERROR(IF(EDATE($C$8,322)>$C$9,\"\",IF(EDATE($C$8,322)>DATE(2099,12,1),\"\",EDATE($C$8,322))),\"\")","v":""},{"$f":"IFERROR(IF(B343=\"\",\"\",VLOOKUP(B343,Índices!$A:$H,5,0)),\"\")","v":""},{"$f":"IFERROR(IF(B343=\"\",\"\",VLOOKUP(B343,Índices!$A:$H,6,0)),\"\")","v":""},{"$f":"IFERROR(IF(B343=\"\",\"\",$C$10*VLOOKUP(B343,Índices!$A:$H,7,0)/VLOOKUP(EDATE($C$8,-1),Índices!$A:$H,7,0)),\"\")","v":""},{"$f":"IFERROR(IF(B343=\"\",\"\",E343*(VLOOKUP(B343,Índices!$A:$H,8,0)-VLOOKUP(EDATE($C$8,-1),Índices!$A:$H,8,0))),\"\")","v":""},null,"vazia"]
[null,{"$f":"IFERROR(IF(EDATE($C$8,323)>$C$9,\"\",IF(EDATE($C$8,323)>DATE(2099,12,1),\"\",EDATE($C$8,323))),\"\")","v":""},{"$f":"IFERROR(IF(B344=\"\",\"\",VLOOKUP(B344,Índices!$A:$H,5,0)),\"\")","v":""},{"$f":"IFERROR(IF(B344=\"\",\"\",VLOOKUP(B344,Índices!$A:$H,6,0)),\"\")","v":""},{"$f":"IFERROR(IF(B344=\"\",\"\",$C$10*VLOOKUP(B344,Índices!$A:$H,7,0)/VLOOKUP(EDATE($C$8,-1),Índices!$A:$H,7,0)),\"\")","v":""},{"$f":"IFERROR(IF(B344=\"\",\"\",E344*(VLOOKUP(B344,Índices!$A:$H,8,0)-VLOOKUP(EDATE($C$8,-1),Índices!$A:$H,8,0))),\"\")","v":""},null,"vazia"]
[null,{"$f":"IFERROR(IF(EDATE($C$8,324)>$C$9,\"\",IF(EDATE($C$8,324)>DATE(2099,12,1),\"\",EDATE($C$8,324))),\"\")","v":""},{"$f":"IFERROR(IF(B345=\"\",\"\",VLOOKUP(B345,Índices!$A:$H,5,0)),\"\")","v":""},{"$f":"IFERROR(IF(B345=\"\",\"\",VLOOKUP(B345,Índices!$A:$H,6,0)),\"\")","v":""},{"$f":"IFERROR(IF(B345=\"\",\"\",$C$10*VLOOKUP(B345,Índices!$A:$H,7,0)/VLOOKUP(EDATE($C$8,-1),Índices!$A:$H,7,0)),\"\")","v":""},{"$f":"IFERROR(IF(B345=\"\",\"\",E345*(VLOOKUP(B345,Índices!$A:$H,8,0)-VLOOKUP(EDATE($C$8,-1),Índices!$A:$H,8,0))),\"\")","v":""},null,"vazia"]
[null,{"$f":"IFERROR(IF(EDATE($C$8,325)>$C$9,\"\",IF(EDATE($C$8,325)>DATE(2099,12,1),\"\",EDATE($C$8,325))),\"\")","v":""},{"$f":"IFERROR(IF(B346=\"\",\"\",VLOOKUP(B346,Índices!$A:$H,5,0)),\"\")","v":""},{"$f":"IFERROR(IF(B346=\"\",\"\",VLOOKUP(B346,Índices!$A:$H,6,0)),\"\")","v":""},{"$f":"IFERROR(IF(B346=\"\",\"\",$C$10*VLOOKUP(B346,Índices!$A:$H,7,0)/VLOOKUP(EDATE($C$8,-1),Índices!$A:$H,7,0)),\"\")","v":""},{"$f":"IFERROR(IF(B346=\"\",\"\",E346*(VLOOKUP(B346,Índices!$A:$H,8,0)-VLOOKUP(EDATE($C$8,-1),Índices!$A:$H,8,0))),\"\")","v":""},null,"vazia"]
[null,{"$f":"IFERROR(IF(EDATE($C$8,326)>$C$9,\"\",IF(EDATE($C$8,326)>DATE(2099,12,1),\"\",EDATE($C$8,326))),\"\")","v":""},{"$f":"IFERROR(IF(B347=\"\",\"\",VLOOKUP(B347,Índices!$A:$H,5,0)),\"\")","v":""},{"$f":"IFERROR(IF(B347=\"\",\"\",VLOOKUP(B347,Índices!$A:$H,6,0)),\"\")","v":""},{"$f":"IFERROR(IF(B347=\"\",\"\",$C$10*VLOOKUP(B347,Índices!$A:$H,7,0)/VLOOKUP(EDATE($C$8,-1),Índices!$A:$H,7,0)),\"\")","v":""},{"$f":"IFERROR(IF(B347=\"\",\"\",E347*(VLOOKUP(B347,Índices!$A:$H,8,0)-VLOOKUP(EDATE($C$8,-1),Índices!$A:$H,8,0))),\"\")","v":""},null,"vazia"]
[null,{"$f":"IFERROR(IF(EDATE($C$8,327)>$C$9,\"\",IF(EDATE($C$8,327)>DATE(2099,12,1),\"\",EDATE($C$8,327))),\"\")","v":""},{"$f":"IFERROR(IF(B348=\"\",\"\",VLOOKUP(B348,Índices!$A:$H,5,0)),\"\")","v":""},{"$f":"IFERROR(IF(B348=\"\",\"\",VLOOKUP(B348,Índices!$A:$H,6,0)),\"\")","v":""},{"$f":"IFERROR(IF(B348=\"\",\"\",$C$10*VLOOKUP(B348,Índices!$A:$H,7,0)/VLOOKUP(EDATE($C$8,-1),Índices!$A:$H,7,0)),\"\")","v":""},{"$f":"IFERROR(IF(B348=\"\",\"\",E348*(VLOOKUP(B348,Índices!$A:$H,8,0)-VLOOKUP(EDATE($C$8,-1),Índices!$A:$H,8,0))),\"\")","v":""},null,"vazia"]
[null,{"$f":"IFERROR(IF(EDATE($C$8,328)>$C$9,\"\",IF(EDATE($C$8,328)>DATE(2099,12,1),\"\",EDATE($C$8,328))),\"\")","v":""},{"$f":"IFERROR(IF(B349=\"\",\"\",VLOOKUP(B349,Índices!$A:$H,5,0)),\"\")","v":""},{"$f":"IFERROR(IF(B349=\"\",\"\",VLOOKUP(B349,Índices!$A:$H,6,0)),\"\")","v":""},{"$f":"IFERROR(IF(B349=\"\",\"\",$C$10*VLOOKUP(B349,Índices!$A:$H,7,0)/VLOOKUP(EDATE($C$8,-1),Índices!$A:$H,7,0)),\"\")","v":""},{"$f":"IFERROR(IF(B349=\"\",\"\",E349*(VLOOKUP(B349,Índices!$A:$H,8,0)-VLOOKUP(EDATE($C$8,-1),Índices!$A:$H,8,0))),\"\")","v":""},null,"vazia"]
[null,{"$f":"IFERROR(IF(EDATE($C$8,329)>$C$9,\"\",IF(EDATE($C$8,329)>DATE(2099,12,1),\"\",EDATE($C$8,329))),\"\")","v":""},{"$f":"IFERROR(IF(B350=\"\",\"\",VLOOKUP(B350,Índices!$A:$H,5,0)),\"\")","v":""},{"$f":"IFERROR(IF(B350=\"\",\"\",VLOOKUP(B350,Índices!$A:$H,6,0)),\"\")","v":""},{"$f":"IFERROR(IF(B350=\"\",\"\",$C$10*VLOOKUP(B350,Índices!$A:$H,7,0)/VLOOKUP(EDATE($C$8,-1),Índices!$A:$H,7,0)),\"\")","v":""},{"$f":"IFERROR(IF(B350=\"\",\"\",E350*(VLOOKUP(B350,Índices!$A:$H,8,0)-VLOOKUP(EDATE($C$8,-1),Índices!$A:$H,8,0))),\"\")","v":""},null,"vazia"]
[null,{"$f":"IFERROR(IF(EDATE($C$8,330)>$C$9,\"\",IF(EDATE($C$8,330)>DATE(2099,12,1),\"\",EDATE($C$8,330))),\"\")","v":""},{"$f":"IFERROR(IF(B351=\"\",\"\",VLOOKUP(B351,Índices!$A:$H,5,0)),\"\")","v":""},{"$f":"IFERROR(IF(B351=\"\",\"\",VLOOKUP(B351,Índices!$A:$H,6,0)),\"\")","v":""},{"$f":"IFERROR(IF(B351=\"\",\"\",$C$10*VLOOKUP(B351,Índices!$A:$H,7,0)/VLOOKUP(EDATE($C$8,-1),Índices!$A:$H,7,0)),\"\")","v":""},{"$f":"IFERROR(IF(B351=\"\",\"\",E351*(VLOOKUP(B351,Índices!$A:$H,8,0)-VLOOKUP(EDATE($C$8,-1),Índices!$A:$H,8,0))),\"\")","v":""},null,"vazia"]
[null,{"$f":"IFERROR(IF(EDATE($C$8,331)>$C$9,\"\",IF(EDATE($C$8,331)>DATE(2099,12,1),\"\",EDATE($C$8,331))),\"\")","v":""},{"$f":"IFERROR(IF(B352=\"\",\"\",VLOOKUP(B352,Índices!$A:$H,5,0)),\"\")","v":""},{"$f":"IFERROR(IF(B352=\"\",\"\",VLOOKUP(B352,Índices!$A:$H,6,0)),\"\")","v":""},{"$f":"IFERROR(IF(B352=\"\",\"\",$C$10*VLOOKUP(B352,Índices!$A:$H,7,0)/VLOOKUP(EDATE($C$8,-1),Índices!$A:$H,7,0)),\"\")","v":""},{"$f":"IFERROR(IF(B352=\"\",\"\",E352*(VLOOKUP(B352,Índices!$A:$H,8,0)-VLOOKUP(EDATE($C$8,-1),Índices!$A:$H,8,0))),\"\")","v":""},null,"vazia"]
[null,{"$f":"IFERROR(IF(EDATE($C$8,332)>$C$9,\"\",IF(EDATE($C$8,332)>DATE(2099,12,1),\"\",EDATE($C$8,332))),\"\")","v":""},{"$f":"IFERROR(IF(B353=\"\",\"\",VLOOKUP(B353,Índices!$A:$H,5,0)),\"\")","v":""},{"$f":"IFERROR(IF(B353=\"\",\"\",VLOOKUP(B353,Índices!$A:$H,6,0)),\"\")","v":""},{"$f":"IFERROR(IF(B353=\"\",\"\",$C$10*VLOOKUP(B353,Índices!$A:$H,7,0)/VLOOKUP(EDATE($C$8,-1),Índices!$A:$H,7,0)),\"\")","v":""},{"$f":"IFERROR(IF(B353=\"\",\"\",E353*(VLOOKUP(B353,Índices!$A:$H,8,0)-VLOOKUP(EDATE($C$8,-1),Índices!$A:$H,8,0))),\"\")","v":""},null,"vazia"]
[null,{"$f":"IFERROR(IF(EDATE($C$8,333)>$C$9,\"\",IF(EDATE($C$8,333)>DATE(2099,12,1),\"\",EDATE($C$8,333))),\"\")","v":""},{"$f":"IFERROR(IF(B354=\"\",\"\",VLOOKUP(B354,Índices!$A:$H,5,0)),\"\")","v":""},{"$f":"IFERROR(IF(B354=\"\",\"\",VLOOKUP(B354,Índices!$A:$H,6,0)),\"\")","v":""},{"$f":"IFERROR(IF(B354=\"\",\"\",$C$10*VLOOKUP(B354,Índices!$A:$H,7,0)/VLOOKUP(EDATE($C$8,-1),Índices!$A:$H,7,0)),\"\")","v":""},{"$f":"IFERROR(IF(B354=\"\",\"\",E354*(VLOOKUP(B354,Índices!$A:$H,8,0)-VLOOKUP(EDATE($C$8,-1),Índices!$A:$H,8,0))),\"\")","v":""},null,"vazia"]
[null,{"$f":"IFERROR(IF(EDATE($C$8,334)>$C$9,\"\",IF(EDATE($C$8,334)>DATE(2099,12,1),\"\",EDATE($C$8,334))),\"\")","v":""},{"$f":"IFERROR(IF(B355=\"\",\"\",VLOOKUP(B355,Índices!$A:$H,5,0)),\"\")","v":""},{"$f":"IFERROR(IF(B355=\"\",\"\",VLOOKUP(B355,Índices!$A:$H,6,0)),\"\")","v":""},{"$f":"IFERROR(IF(B355=\"\",\"\",$C$10*VLOOKUP(B355,Índices!$A:$H,7,0)/VLOOKUP(EDATE($C$8,-1),Índices!$A:$H,7,0)),\"\")","v":""},{"$f":"IFERROR(IF(B355=\"\",\"\",E355*(VLOOKUP(B355,Índices!$A:$H,8,0)-VLOOKUP(EDATE($C$8,-1),Índices!$A:$H,8,0))),\"\")","v":""},null,"vazia"]
[null,{"$f":"IFERROR(IF(EDATE($C$8,335)>$C$9,\"\",IF(EDATE($C$8,335)>DATE(2099,12,1),\"\",EDATE($C$8,335))),\"\")","v":""},{"$f":"IFERROR(IF(B356=\"\",\"\",VLOOKUP(B356,Índices!$A:$H,5,0)),\"\")","v":""},{"$f":"IFERROR(IF(B356=\"\",\"\",VLOOKUP(B356,Índices!$A:$H,6,0)),\"\")","v":""},{"$f":"IFERROR(IF(B356=\"\",\"\",$C$10*VLOOKUP(B356,Índices!$A:$H,7,0)/VLOOKUP(EDATE($C$8,-1),Índices!$A:$H,7,0)),\"\")","v":""},{"$f":"IFERROR(IF(B356=\"\",\"\",E356*(VLOOKUP(B356,Índices!$A:$H,8,0)-VLOOKUP(EDATE($C$8,-1),Índices!$A:$H,8,0))),\"\")","v":""},null,"vazia"]
[null,{"$f":"IFERROR(IF(EDATE($C$8,336)>$C$9,\"\",IF(EDATE($C$8,336)>DATE(2099,12,1),\"\",EDATE($C$8,336))),\"\")","v":""},{"$f":"IFERROR(IF(B357=\"\",\"\",VLOOKUP(B357,Índices!$A:$H,5,0)),\"\")","v":""},{"$f":"IFERROR(IF(B357=\"\",\"\",VLOOKUP(B357,Índices!$A:$H,6,0)),\"\")","v":""},{"$f":"IFERROR(IF(B357=\"\",\"\",$C$10*VLOOKUP(B357,Índices!$A:$H,7,0)/VLOOKUP(EDATE($C$8,-1),Índices!$A:$H,7,0)),\"\")","v":""},{"$f":"IFERROR(IF(B357=\"\",\"\",E357*(VLOOKUP(B357,Índices!$A:$H,8,0)-VLOOKUP(EDATE($C$8,-1),Índices!$A:$H,8,0))),\"\")","v":""},null,"vazia"]
[null,{"$f":"IFERROR(IF(EDATE($C$8,337)>$C$9,\"\",IF(EDATE($C$8,337)>DATE(2099,12,1),\"\",EDATE($C$8,337))),\"\")","v":""},{"$f":"IFERROR(IF(B358=\"\",\"\",VLOOKUP(B358,Índices!$A:$H,5,0)),\"\")","v":""},{"$f":"IFERROR(IF(B358=\"\",\"\",VLOOKUP(B358,Índices!$A:$H,6,0)),\"\")","v":""},{"$f":"IFERROR(IF(B358=\"\",\"\",$C$10*VLOOKUP(B358,Índices!$A:$H,7,0)/VLOOKUP(EDATE($C$8,-1),Índices!$A:$H,7,0)),\"\")","v":""},{"$f":"IFERROR(IF(B358=\"\",\"\",E358*(VLOOKUP(B358,Índices!$A:$H,8,0)-VLOOKUP(EDATE($C$8,-1),Índices!$A:$H,8,0))),\"\")","v":""},null,"vazia"]
[null,{"$f":"IFERROR(IF(EDATE($C$8,338)>$C$9,\"\",IF(EDATE($C$8,338)>DATE(2099,12,1),\"\",EDATE($C$8,338))),\"\")","v":""},{"$f":"IFERROR(IF(B359=\"\",\"\",VLOOKUP(B359,Índices!$A:$H,5,0)),\"\")","v":""},{"$f":"IFERROR(IF(B359=\"\",\"\",VLOOKUP(B359,Índices!$A:$H,6,0)),\"\")","v":""},{"$f":"IFERROR(IF(B359=\"\",\"\",$C$10*VLOOKUP(B359,Índices!$A:$H,7,0)/VLOOKUP(EDATE($C$8,-1),Índices!$A:$H,7,0)),\"\")","v":""},{"$f":"IFERROR(IF(B359=\"\",\"\",E359*(VLOOKUP(B359,Índices!$A:$H,8,0)-VLOOKUP(EDATE($C$8,-1),Índices!$A:$H,8,0))),\"\")","v":""},null,"vazia"]
[null,{"$f":"IFERROR(IF(EDATE($C$8,339)>$C$9,\"\",IF(EDATE($C$8,339)>DATE(2099,12,1),\"\",EDATE($C$8,339))),\"\")","v":""},{"$f":"IFERROR(IF(B360=\"\",\"\",VLOOKUP(B360,Índices!$A:$H,5,0)),\"\")","v":""},{"$f":"IFERROR(IF(B360=\"\",\"\",VLOOKUP(B360,Índices!$A:$H,6,0)),\"\")","v":""},{"$f":"IFERROR(IF(B360=\"\",\"\",$C$10*VLOOKUP(B360,Índices!$A:$H,7,0)/VLOOKUP(EDATE($C$8,-1),Índices!$A:$H,7,0)),\"\")","v":""},{"$f":"IFERROR(IF(B360=\"\",\"\",E360*(VLOOKUP(B360,Índices!$A:$H,8,0)-VLOOKUP(EDATE($C$8,-1),Índices!$A:$H,8,0))),\"\")","v":""},null,"vazia"]
[null,{"$f":"IFERROR(IF(EDATE($C$8,340)>$C$9,\"\",IF(EDATE($C$8,340)>DATE(2099,12,1),\"\",EDATE($C$8,340))),\"\")","v":""},{"$f":"IFERROR(IF(B361=\"\",\"\",VLOOKUP(B361,Índices!$A:$H,5,0)),\"\")","v":""},{"$f":"IFERROR(IF(B361=\"\",\"\",VLOOKUP(B361,Índices!$A:$H,6,0)),\"\")","v":""},{"$f":"IFERROR(IF(B361=\"\",\"\",$C$10*VLOOKUP(B361,Índices!$A:$H,7,0)/VLOOKUP(EDATE($C$8,-1),Índices!$A:$H,7,0)),\"\")","v":""},{"$f":"IFERROR(IF(B361=\"\",\"\",E361*(VLOOKUP(B361,Índices!$A:$H,8,0)-VLOOKUP(EDATE($C$8,-1),Índices!$A:$H,8,0))),\"\")","v":""},null,"vazia"]
[null,{"$f":"IFERROR(IF(EDATE($C$8,341)>$C$9,\"\",IF(EDATE($C$8,341)>DATE(2099,12,1),\"\",EDATE($C$8,341))),\"\")","v":""},{"$f":"IFERROR(IF(B362=\"\",\"\",VLOOKUP(B362,Índices!$A:$H,5,0)),\"\")","v":""},{"$f":"IFERROR(IF(B362=\"\",\"\",VLOOKUP(B362,Índices!$A:$H,6,0)),\"\")","v":""},{"$f":"IFERROR(IF(B362=\"\",\"\",$C$10*VLOOKUP(B362,Índices!$A:$H,7,0)/VLOOKUP(EDATE($C$8,-1),Índices!$A:$H,7,0)),\"\")","v":""},{"$f":"IFERROR(IF(B362=\"\",\"\",E362*(VLOOKUP(B362,Índices!$A:$H,8,0)-VLOOKUP(EDATE($C$8,-1),Índices!$A:$H,8,0))),\"\")","v":""},null,"vazia"]
[null,{"$f":"IFERROR(IF(EDATE($C$8,342)>$C$9,\"\",IF(EDATE($C$8,342)>DATE(2099,12,1),\"\",EDATE($C$8,342))),\"\")","v":""},{"$f":"IFERROR(IF(B363=\"\",\"\",VLOOKUP(B363,Índices!$A:$H,5,0)),\"\")","v":""},{"$f":"IFERROR(IF(B363=\"\",\"\",VLOOKUP(B363,Índices!$A:$H,6,0)),\"\")","v":""},{"$f":"IFERROR(IF(B363=\"\",\"\",$C$10*VLOOKUP(B363,Índices!$A:$H,7,0)/VLOOKUP(EDATE($C$8,-1),Índices!$A:$H,7,0)),\"\")","v":""},{"$f":"IFERROR(IF(B363=\"\",\"\",E363*(VLOOKUP(B363,Índices!$A:$H,8,0)-VLOOKUP(EDATE($C$8,-1),Índices!$A:$H,8,0))),\"\")","v":""},null,"vazia"]
[null,{"$f":"IFERROR(IF(EDATE($C$8,343)>$C$9,\"\",IF(EDATE($C$8,343)>DATE(2099,12,1),\"\",EDATE($C$8,343))),\"\")","v":""},{"$f":"IFERROR(IF(B364=\"\",\"\",VLOOKUP(B364,Índices!$A:$H,5,0)),\"\")","v":""},{"$f":"IFERROR(IF(B364=\"\",\"\",VLOOKUP(B364,Índices!$A:$H,6,0)),\"\")","v":""},{"$f":"IFERROR(IF(B364=\"\",\"\",$C$10*VLOOKUP(B364,Índices!$A:$H,7,0)/VLOOKUP(EDATE($C$8,-1),Índices!$A:$H,7,0)),\"\")","v":""},{"$f":"IFERROR(IF(B364=\"\",\"\",E364*(VLOOKUP(B364,Índices!$A:$H,8,0)-VLOOKUP(EDATE($C$8,-1),Índices!$A:$H,8,0))),\"\")","v":""},null,"vazia"]
[null,{"$f":"IFERROR(IF(EDATE($C$8,344)>$C$9,\"\",IF(EDATE($C$8,344)>DATE(2099,12,1),\"\",EDATE($C$8,344))),\"\")","v":""},{"$f":"IFERROR(IF(B365=\"\",\"\",VLOOKUP(B365,Índices!$A:$H,5,0)),\"\")","v":""},{"$f":"IFERROR(IF(B365=\"\",\"\",VLOOKUP(B365,Índices!$A:$H,6,0)),\"\")","v":""},{"$f":"IFERROR(IF(B365=\"\",\"\",$C$10*VLOOKUP(B365,Índices!$A:$H,7,0)/VLOOKUP(EDATE($C$8,-1),Índices!$A:$H,7,0)),\"\")","v":""},{"$f":"IFERROR(IF(B365=\"\",\"\",E365*(VLOOKUP(B365,Índices!$A:$H,8,0)-VLOOKUP(EDATE($C$8,-1),Índices!$A:$H,8,0))),\"\")","v":""},null,"vazia"]
[null,{"$f":"IFERROR(IF(EDATE($C$8,345)>$C$9,\"\",IF(EDATE($C$8,345)>DATE(2099,12,1),\"\",EDATE($C$8,345))),\"\")","v":""},{"$f":"IFERROR(IF(B366=\"\",\"\",VLOOKUP(B366,Índices!$A:$H,5,0)),\"\")","v":""},{"$f":"IFERROR(IF(B366=\"\",\"\",VLOOKUP(B366,Índices!$A:$H,6,0)),\"\")","v":""},{"$f":"IFERROR(IF(B366=\"\",\"\",$C$10*VLOOKUP(B366,Índices!$A:$H,7,0)/VLOOKUP(EDATE($C$8,-1),Índices!$A:$H,7,0)),\"\")","v":""},{"$f":"IFERROR(IF(B366=\"\",\"\",E366*(VLOOKUP(B366,Índices!$A:$H,8,0)-VLOOKUP(EDATE($C$8,-1),Índices!$A:$H,8,0))),\"\")","v":""},null,"vazia"]
[null,{"$f":"IFERROR(IF(EDATE($C$8,346)>$C$9,\"\",IF(EDATE($C$8,346)>DATE(2099,12,1),\"\",EDATE($C$8,346))),\"\")","v":""},{"$f":"IFERROR(IF(B367=\"\",\"\",VLOOKUP(B367,Índices!$A:$H,5,0)),\"\")","v":""},{"$f":"IFERROR(IF(B367=\"\",\"\",VLOOKUP(B367,Índices!$A:$H,6,0)),\"\")","v":""},{"$f":"IFERROR(IF(B367=\"\",\"\",$C$10*VLOOKUP(B367,Índices!$A:$H,7,0)/VLOOKUP(EDATE($C$8,-1),Índices!$A:$H,7,0)),\"\")","v":""},{"$f":"IFERROR(IF(B367=\"\",\"\",E367*(VLOOKUP(B367,Índices!$A:$H,8,0)-VLOOKUP(EDATE($C$8,-1),Índices!$A:$H,8,0))),\"\")","v":""},null,"vazia"]
[null,{"$f":"IFERROR(IF(EDATE($C$8,347)>$C$9,\"\",IF(EDATE($C$8,347)>DATE(2099,12,1),\"\",EDATE($C$8,347))),\"\")","v":""},{"$f":"IFERROR(IF(B368=\"\",\"\",VLOOKUP(B368,Índices!$A:$H,5,0)),\"\")","v":""},{"$f":"IFERROR(IF(B368=\"\",\"\",VLOOKUP(B368,Índices!$A:$H,6,0)),\"\")","v":""},{"$f":"IFERROR(IF(B368=\"\",\"\",$C$10*VLOOKUP(B368,Índices!$A:$H,7,0)/VLOOKUP(EDATE($C$8,-1),Índices!$A:$H,7,0)),\"\")","v":""},{"$f":"IFERROR(IF(B368=\"\",\"\",E368*(VLOOKUP(B368,Índices!$A:$H,8,0)-VLOOKUP(EDATE($C$8,-1),Índices!$A:$H,8,0))),\"\")","v":""},null,"vazia"]
[null,{"$f":"IFERROR(IF(EDATE($C$8,348)>$C$9,\"\",IF(EDATE($C$8,348)>DATE(2099,12,1),\"\",EDATE($C$8,348))),\"\")","v":""},{"$f":"IFERROR(IF(B369=\"\",\"\",VLOOKUP(B369,Índices!$A:$H,5,0)),\"\")","v":""},{"$f":"IFERROR(IF(B369=\"\",\"\",VLOOKUP(B369,Índices!$A:$H,6,0)),\"\")","v":""},{"$f":"IFERROR(IF(B369=\"\",\"\",$C$10*VLOOKUP(B369,Índices!$A:$H,7,0)/VLOOKUP(EDATE($C$8,-1),Índices!$A:$H,7,0)),\"\")","v":""},{"$f":"IFERROR(IF(B369=\"\",\"\",E369*(VLOOKUP(B369,Índices!$A:$H,8,0)-VLOOKUP(EDATE($C$8,-1),Índices!$A:$H,8,0))),\"\")","v":""},null,"vazia"]
[null,{"$f":"IFERROR(IF(EDATE($C$8,349)>$C$9,\"\",IF(EDATE($C$8,349)>DATE(2099,12,1),\"\",EDATE($C$8,349))),\"\")","v":""},{"$f":"IFERROR(IF(B370=\"\",\"\",VLOOKUP(B370,Índices!$A:$H,5,0)),\"\")","v":""},{"$f":"IFERROR(IF(B370=\"\",\"\",VLOOKUP(B370,Índices!$A:$H,6,0)),\"\")","v":""},{"$f":"IFERROR(IF(B370=\"\",\"\",$C$10*VLOOKUP(B370,Índices!$A:$H,7,0)/VLOOKUP(EDATE($C$8,-1),Índices!$A:$H,7,0)),\"\")","v":""},{"$f":"IFERROR(IF(B370=\"\",\"\",E370*(VLOOKUP(B370,Índices!$A:$H,8,0)-VLOOKUP(EDATE($C$8,-1),Índices!$A:$H,8,0))),\"\")","v":""},null,"vazia"]
[null,{"$f":"IFERROR(IF(EDATE($C$8,350)>$C$9,\"\",IF(EDATE($C$8,350)>DATE(2099,12,1),\"\",EDATE($C$8,350))),\"\")","v":""},{"$f":"IFERROR(IF(B371=\"\",\"\",VLOOKUP(B371,Índices!$A:$H,5,0)),\"\")","v":""},{"$f":"IFERROR(IF(B371=\"\",\"\",VLOOKUP(B371,Índices!$A:$H,6,0)),\"\")","v":""},{"$f":"IFERROR(IF(B371=\"\",\"\",$C$10*VLOOKUP(B371,Índices!$A:$H,7,0)/VLOOKUP(EDATE($C$8,-1),Índices!$A:$H,7,0)),\"\")","v":""},{"$f":"IFERROR(IF(B371=\"\",\"\",E371*(VLOOKUP(B371,Índices!$A:$H,8,0)-VLOOKUP(EDATE($C$8,-1),Índices!$A:$H,8,0))),\"\")","v":""},null,"vazia"]
[null,{"$f":"IFERROR(IF(EDATE($C$8,351)>$C$9,\"\",IF(EDATE($C$8,351)>DATE(2099,12,1),\"\",EDATE($C$8,351))),\"\")","v":""},{"$f":"IFERROR(IF(B372=\"\",\"\",VLOOKUP(B372,Índices!$A:$H,5,0)),\"\")","v":""},{"$f":"IFERROR(IF(B372=\"\",\"\",VLOOKUP(B372,Índices!$A:$H,6,0)),\"\")","v":""},{"$f":"IFERROR(IF(B372=\"\",\"\",$C$10*VLOOKUP(B372,Índices!$A:$H,7,0)/VLOOKUP(EDATE($C$8,-1),Índices!$A:$H,7,0)),\"\")","v":""},{"$f":"IFERROR(IF(B372=\"\",\"\",E372*(VLOOKUP(B372,Índices!$A:$H,8,0)-VLOOKUP(EDATE($C$8,-1),Índices!$A:$H,8,0))),\"\")","v":""},null,"vazia"]
[null,{"$f":"IFERROR(IF(EDATE($C$8,352)>$C$9,\"\",IF(EDATE($C$8,352)>DATE(2099,12,1),\"\",EDATE($C$8,352))),\"\")","v":""},{"$f":"IFERROR(IF(B373=\"\",\"\",VLOOKUP(B373,Índices!$A:$H,5,0)),\"\")","v":""},{"$f":"IFERROR(IF(B373=\"\",\"\",VLOOKUP(B373,Índices!$A:$H,6,0)),\"\")","v":""},{"$f":"IFERROR(IF(B373=\"\",\"\",$C$10*VLOOKUP(B373,Índices!$A:$H,7,0)/VLOOKUP(EDATE($C$8,-1),Índices!$A:$H,7,0)),\"\")","v":""},{"$f":"IFERROR(IF(B373=\"\",\"\",E373*(VLOOKUP(B373,Índices!$A:$H,8,0)-VLOOKUP(EDATE($C$8,-1),Índices!$A:$H,8,0))),\"\")","v":""},null,"vazia"]
[null,{"$f":"IFERROR(IF(EDATE($C$8,353)>$C$9,\"\",IF(EDATE($C$8,353)>DATE(2099,12,1),\"\",EDATE($C$8,353))),\"\")","v":""},{"$f":"IFERROR(IF(B374=\"\",\"\",VLOOKUP(B374,Índices!$A:$H,5,0)),\"\")","v":""},{"$f":"IFERROR(IF(B374=\"\",\"\",VLOOKUP(B374,Índices!$A:$H,6,0)),\"\")","v":""},{"$f":"IFERROR(IF(B374=\"\",\"\",$C$10*VLOOKUP(B374,Índices!$A:$H,7,0)/VLOOKUP(EDATE($C$8,-1),Índices!$A:$H,7,0)),\"\")","v":""},{"$f":"IFERROR(IF(B374=\"\",\"\",E374*(VLOOKUP(B374,Índices!$A:$H,8,0)-VLOOKUP(EDATE($C$8,-1),Índices!$A:$H,8,0))),\"\")","v":""},null,"vazia"]
[null,{"$f":"IFERROR(IF(EDATE($C$8,354)>$C$9,\"\",IF(EDATE($C$8,354)>DATE(2099,12,1),\"\",EDATE($C$8,354))),\"\")","v":""},{"$f":"IFERROR(IF(B375=\"\",\"\",VLOOKUP(B375,Índices!$A:$H,5,0)),\"\")","v":""},{"$f":"IFERROR(IF(B375=\"\",\"\",VLOOKUP(B375,Índices!$A:$H,6,0)),\"\")","v":""},{"$f":"IFERROR(IF(B375=\"\",\"\",$C$10*VLOOKUP(B375,Índices!$A:$H,7,0)/VLOOKUP(EDATE($C$8,-1),Índices!$A:$H,7,0)),\"\")","v":""},{"$f":"IFERROR(IF(B375=\"\",\"\",E375*(VLOOKUP(B375,Índices!$A:$H,8,0)-VLOOKUP(EDATE($C$8,-1),Índices!$A:$H,8,0))),\"\")","v":""},null,"vazia"]
[null,{"$f":"IFERROR(IF(EDATE($C$8,355)>$C$9,\"\",IF(EDATE($C$8,355)>DATE(2099,12,1),\"\",EDATE($C$8,355))),\"\")","v":""},{"$f":"IFERROR(IF(B376=\"\",\"\",VLOOKUP(B376,Índices!$A:$H,5,0)),\"\")","v":""},{"$f":"IFERROR(IF(B376=\"\",\"\",VLOOKUP(B376,Índices!$A:$H,6,0)),\"\")","v":""},{"$f":"IFERROR(IF(B376=\"\",\"\",$C$10*VLOOKUP(B376,Índices!$A:$H,7,0)/VLOOKUP(EDATE($C$8,-1),Índices!$A:$H,7,0)),\"\")","v":""},{"$f":"IFERROR(IF(B376=\"\",\"\",E376*(VLOOKUP(B376,Índices!$A:$H,8,0)-VLOOKUP(EDATE($C$8,-1),Índices!$A:$H,8,0))),\"\")","v":""},null,"vazia"]
[null,{"$f":"IFERROR(IF(EDATE($C$8,356)>$C$9,\"\",IF(EDATE($C$8,356)>DATE(2099,12,1),\"\",EDATE($C$8,356))),\"\")","v":""},{"$f":"IFERROR(IF(B377=\"\",\"\",VLOOKUP(B377,Índices!$A:$H,5,0)),\"\")","v":""},{"$f":"IFERROR(IF(B377=\"\",\"\",VLOOKUP(B377,Índices!$A:$H,6,0)),\"\")","v":""},{"$f":"IFERROR(IF(B377=\"\",\"\",$C$10*VLOOKUP(B377,Índices!$A:$H,7,0)/VLOOKUP(EDATE($C$8,-1),Índices!$A:$H,7,0)),\"\")","v":""},{"$f":"IFERROR(IF(B377=\"\",\"\",E377*(VLOOKUP(B377,Índices!$A:$H,8,0)-VLOOKUP(EDATE($C$8,-1),Índices!$A:$H,8,0))),\"\")","v":""},null,"vazia"]
[null,{"$f":"IFERROR(IF(EDATE($C$8,357)>$C$9,\"\",IF(EDATE($C$8,357)>DATE(2099,12,1),\"\",EDATE($C$8,357))),\"\")","v":""},{"$f":"IFERROR(IF(B378=\"\",\"\",VLOOKUP(B378,Índices!$A:$H,5,0)),\"\")","v":""},{"$f":"IFERROR(IF(B378=\"\",\"\",VLOOKUP(B378,Índices!$A:$H,6,0)),\"\")","v":""},{"$f":"IFERROR(IF(B378=\"\",\"\",$C$10*VLOOKUP(B378,Índices!$A:$H,7,0)/VLOOKUP(EDATE($C$8,-1),Índices!$A:$H,7,0)),\"\")","v":""},{"$f":"IFERROR(IF(B378=\"\",\"\",E378*(VLOOKUP(B378,Índices!$A:$H,8,0)-VLOOKUP(EDATE($C$8,-1),Índices!$A:$H,8,0))),\"\")","v":""},null,"vazia"]
[null,{"$f":"IFERROR(IF(EDATE($C$8,358)>$C$9,\"\",IF(EDATE($C$8,358)>DATE(2099,12,1),\"\",EDATE($C$8,358))),\"\")","v":""},{"$f":"IFERROR(IF(B379=\"\",\"\",VLOOKUP(B379,Índices!$A:$H,5,0)),\"\")","v":""},{"$f":"IFERROR(IF(B379=\"\",\"\",VLOOKUP(B379,Índices!$A:$H,6,0)),\"\")","v":""},{"$f":"IFERROR(IF(B379=\"\",\"\",$C$10*VLOOKUP(B379,Índices!$A:$H,7,0)/VLOOKUP(EDATE($C$8,-1),Índices!$A:$H,7,0)),\"\")","v":""},{"$f":"IFERROR(IF(B379=\"\",\"\",E379*(VLOOKUP(B379,Índices!$A:$H,8,0)-VLOOKUP(EDATE($C$8,-1),Índices!$A:$H,8,0))),\"\")","v":""},null,"vazia"]
[null,{"$f":"IFERROR(IF(EDATE($C$8,359)>$C$9,\"\",IF(EDATE($C$8,359)>DATE(2099,12,1),\"\",EDATE($C$8,359))),\"\")","v":""},{"$f":"IFERROR(IF(B380=\"\",\"\",VLOOKUP(B380,Índices!$A:$H,5,0)),\"\")","v":""},{"$f":"IFERROR(IF(B380=\"\",\"\",VLOOKUP(B380,Índices!$A:$H,6,0)),\"\")","v":""},{"$f":"IFERROR(IF(B380=\"\",\"\",$C$10*VLOOKUP(B380,Índices!$A:$H,7,0)/VLOOKUP(EDATE($C$8,-1),Índices!$A:$H,7,0)),\"\")","v":""},{"$f":"IFERROR(IF(B380=\"\",\"\",E380*(VLOOKUP(B380,Índices!$A:$H,8,0)-VLOOKUP(EDATE($C$8,-1),Índices!$A:$H,8,0))),\"\")","v":""},null,"vazia"]
[null,{"$f":"IFERROR(IF(EDATE($C$8,360)>$C$9,\"\",IF(EDATE($C$8,360)>DATE(2099,12,1),\"\",EDATE($C$8,360))),\"\")","v":""},{"$f":"IFERROR(IF(B381=\"\",\"\",VLOOKUP(B381,Índices!$A:$H,5,0)),\"\")","v":""},{"$f":"IFERROR(IF(B381=\"\",\"\",VLOOKUP(B381,Índices!$A:$H,6,0)),\"\")","v":""},{"$f":"IFERROR(IF(B381=\"\",\"\",$C$10*VLOOKUP(B381,Índices!$A:$H,7,0)/VLOOKUP(EDATE($C$8,-1),Índices!$A:$H,7,0)),\"\")","v":""},{"$f":"IFERROR(IF(B381=\"\",\"\",E381*(VLOOKUP(B381,Índices!$A:$H,8,0)-VLOOKUP(EDATE($C$8,-1),Índices!$A:$H,8,0))),\"\")","v":""},null,"vazia"]
[null,{"$f":"IFERROR(IF(EDATE($C$8,361)>$C$9,\"\",IF(EDATE($C$8,361)>DATE(2099,12,1),\"\",EDATE($C$8,361))),\"\")","v":""},{"$f":"IFERROR(IF(B382=\"\",\"\",VLOOKUP(B382,Índices!$A:$H,5,0)),\"\")","v":""},{"$f":"IFERROR(IF(B382=\"\",\"\",VLOOKUP(B382,Índices!$A:$H,6,0)),\"\")","v":""},{"$f":"IFERROR(IF(B382=\"\",\"\",$C$10*VLOOKUP(B382,Índices!$A:$H,7,0)/VLOOKUP(EDATE($C$8,-1),Índices!$A:$H,7,0)),\"\")","v":""},{"$f":"IFERROR(IF(B382=\"\",\"\",E382*(VLOOKUP(B382,Índices!$A:$H,8,0)-VLOOKUP(EDATE($C$8,-1),Índices!$A:$H,8,0))),\"\")","v":""},null,"vazia"]
[null,{"$f":"IFERROR(IF(EDATE($C$8,362)>$C$9,\"\",IF(EDATE($C$8,362)>DATE(2099,12,1),\"\",EDATE($C$8,362))),\"\")","v":""},{"$f":"IFERROR(IF(B383=\"\",\"\",VLOOKUP(B383,Índices!$A:$H,5,0)),\"\")","v":""},{"$f":"IFERROR(IF(B383=\"\",\"\",VLOOKUP(B383,Índices!$A:$H,6,0)),\"\")","v":""},{"$f":"IFERROR(IF(B383=\"\",\"\",$C$10*VLOOKUP(B383,Índices!$A:$H,7,0)/VLOOKUP(EDATE($C$8,-1),Índices!$A:$H,7,0)),\"\")","v":""},{"$f":"IFERROR(IF(B383=\"\",\"\",E383*(VLOOKUP(B383,Índices!$A:$H,8,0)-VLOOKUP(EDATE($C$8,-1),Índices!$A:$H,8,0))),\"\")","v":""},null,"vazia"]
[null,{"$f":"IFERROR(IF(EDATE($C$8,363)>$C$9,\"\",IF(EDATE($C$8,363)>DATE(2099,12,1),\"\",EDATE($C$8,363))),\"\")","v":""},{"$f":"IFERROR(IF(B384=\"\",\"\",VLOOKUP(B384,Índices!$A:$H,5,0)),\"\")","v":""},{"$f":"IFERROR(IF(B384=\"\",\"\",VLOOKUP(B384,Índices!$A:$H,6,0)),\"\")","v":""},{"$f":"IFERROR(IF(B384=\"\",\"\",$C$10*VLOOKUP(B384,Índices!$A:$H,7,0)/VLOOKUP(EDATE($C$8,-1),Índices!$A:$H,7,0)),\"\")","v":""},{"$f":"IFERROR(IF(B384=\"\",\"\",E384*(VLOOKUP(B384,Índices!$A:$H,8,0)-VLOOKUP(EDATE($C$8,-1),Índices!$A:$H,8,0))),\"\")","v":""},null,"vazia"]
[null,{"$f":"IFERROR(IF(EDATE($C$8,364)>$C$9,\"\",IF(EDATE($C$8,364)>DATE(2099,12,1),\"\",EDATE($C$8,364))),\"\")","v":""},{"$f":"IFERROR(IF(B385=\"\",\"\",VLOOKUP(B385,Índices!$A:$H,5,0)),\"\")","v":""},{"$f":"IFERROR(IF(B385=\"\",\"\",VLOOKUP(B385,Índices!$A:$H,6,0)),\"\")","v":""},{"$f":"IFERROR(IF(B385=\"\",\"\",$C$10*VLOOKUP(B385,Índices!$A:$H,7,0)/VLOOKUP(EDATE($C$8,-1),Índices!$A:$H,7,0)),\"\")","v":""},{"$f":"IFERROR(IF(B385=\"\",\"\",E385*(VLOOKUP(B385,Índices!$A:$H,8,0)-VLOOKUP(EDATE($C$8,-1),Índices!$A:$H,8,0))),\"\")","v":""},null,"vazia"]
[null,{"$f":"IFERROR(IF(EDATE($C$8,365)>$C$9,\"\",IF(EDATE($C$8,365)>DATE(2099,12,1),\"\",EDATE($C$8,365))),\"\")","v":""},{"$f":"IFERROR(IF(B386=\"\",\"\",VLOOKUP(B386,Índices!$A:$H,5,0)),\"\")","v":""},{"$f":"IFERROR(IF(B386=\"\",\"\",VLOOKUP(B386,Índices!$A:$H,6,0)),\"\")","v":""},{"$f":"IFERROR(IF(B386=\"\",\"\",$C$10*VLOOKUP(B386,Índices!$A:$H,7,0)/VLOOKUP(EDATE($C$8,-1),Índices!$A:$H,7,0)),\"\")","v":""},{"$f":"IFERROR(IF(B386=\"\",\"\",E386*(VLOOKUP(B386,Índices!$A:$H,8,0)-VLOOKUP(EDATE($C$8,-1),Índices!$A:$H,8,0))),\"\")","v":""},null,"vazia"]
[null,{"$f":"IFERROR(IF(EDATE($C$8,366)>$C$9,\"\",IF(EDATE($C$8,366)>DATE(2099,12,1),\"\",EDATE($C$8,366))),\"\")","v":""},{"$f":"IFERROR(IF(B387=\"\",\"\",VLOOKUP(B387,Índices!$A:$H,5,0)),\"\")","v":""},{"$f":"IFERROR(IF(B387=\"\",\"\",VLOOKUP(B387,Índices!$A:$H,6,0)),\"\")","v":""},{"$f":"IFERROR(IF(B387=\"\",\"\",$C$10*VLOOKUP(B387,Índices!$A:$H,7,0)/VLOOKUP(EDATE($C$8,-1),Índices!$A:$H,7,0)),\"\")","v":""},{"$f":"IFERROR(IF(B387=\"\",\"\",E387*(VLOOKUP(B387,Índices!$A:$H,8,0)-VLOOKUP(EDATE($C$8,-1),Índices!$A:$H,8,0))),\"\")","v":""},null,"vazia"]
[null,{"$f":"IFERROR(IF(EDATE($C$8,367)>$C$9,\"\",IF(EDATE($C$8,367)>DATE(2099,12,1),\"\",EDATE($C$8,367))),\"\")","v":""},{"$f":"IFERROR(IF(B388=\"\",\"\",VLOOKUP(B388,Índices!$A:$H,5,0)),\"\")","v":""},{"$f":"IFERROR(IF(B388=\"\",\"\",VLOOKUP(B388,Índices!$A:$H,6,0)),\"\")","v":""},{"$f":"IFERROR(IF(B388=\"\",\"\",$C$10*VLOOKUP(B388,Índices!$A:$H,7,0)/VLOOKUP(EDATE($C$8,-1),Índices!$A:$H,7,0)),\"\")","v":""},{"$f":"IFERROR(IF(B388=\"\",\"\",E388*(VLOOKUP(B388,Índices!$A:$H,8,0)-VLOOKUP(EDATE($C$8,-1),Índices!$A:$H,8,0))),\"\")","v":""},null,"vazia"]
[null,{"$f":"IFERROR(IF(EDATE($C$8,368)>$C$9,\"\",IF(EDATE($C$8,368)>DATE(2099,12,1),\"\",EDATE($C$8,368))),\"\")","v":""},{"$f":"IFERROR(IF(B389=\"\",\"\",VLOOKUP(B389,Índices!$A:$H,5,0)),\"\")","v":""},{"$f":"IFERROR(IF(B389=\"\",\"\",VLOOKUP(B389,Índices!$A:$H,6,0)),\"\")","v":""},{"$f":"IFERROR(IF(B389=\"\",\"\",$C$10*VLOOKUP(B389,Índices!$A:$H,7,0)/VLOOKUP(EDATE($C$8,-1),Índices!$A:$H,7,0)),\"\")","v":""},{"$f":"IFERROR(IF(B389=\"\",\"\",E389*(VLOOKUP(B389,Índices!$A:$H,8,0)-VLOOKUP(EDATE($C$8,-1),Índices!$A:$H,8,0))),\"\")","v":""},null,"vazia"]
[null,{"$f":"IFERROR(IF(EDATE($C$8,369)>$C$9,\"\",IF(EDATE($C$8,369)>DATE(2099,12,1),\"\",EDATE($C$8,369))),\"\")","v":""},{"$f":"IFERROR(IF(B390=\"\",\"\",VLOOKUP(B390,Índices!$A:$H,5,0)),\"\")","v":""},{"$f":"IFERROR(IF(B390=\"\",\"\",VLOOKUP(B390,Índices!$A:$H,6,0)),\"\")","v":""},{"$f":"IFERROR(IF(B390=\"\",\"\",$C$10*VLOOKUP(B390,Índices!$A:$H,7,0)/VLOOKUP(EDATE($C$8,-1),Índices!$A:$H,7,0)),\"\")","v":""},{"$f":"IFERROR(IF(B390=\"\",\"\",E390*(VLOOKUP(B390,Índices!$A:$H,8,0)-VLOOKUP(EDATE($C$8,-1),Índices!$A:$H,8,0))),\"\")","v":""},null,"vazia"]
[null,{"$f":"IFERROR(IF(EDATE($C$8,370)>$C$9,\"\",IF(EDATE($C$8,370)>DATE(2099,12,1),\"\",EDATE($C$8,370))),\"\")","v":""},{"$f":"IFERROR(IF(B391=\"\",\"\",VLOOKUP(B391,Índices!$A:$H,5,0)),\"\")","v":""},{"$f":"IFERROR(IF(B391=\"\",\"\",VLOOKUP(B391,Índices!$A:$H,6,0)),\"\")","v":""},{"$f":"IFERROR(IF(B391=\"\",\"\",$C$10*VLOOKUP(B391,Índices!$A:$H,7,0)/VLOOKUP(EDATE($C$8,-1),Índices!$A:$H,7,0)),\"\")","v":""},{"$f":"IFERROR(IF(B391=\"\",\"\",E391*(VLOOKUP(B391,Índices!$A:$H,8,0)-VLOOKUP(EDATE($C$8,-1),Índices!$A:$H,8,0))),\"\")","v":""},null,"vazia"]
[null,{"$f":"IFERROR(IF(EDATE($C$8,371)>$C$9,\"\",IF(EDATE($C$8,371)>DATE(2099,12,1),\"\",EDATE($C$8,371))),\"\")","v":""},{"$f":"IFERROR(IF(B392=\"\",\"\",VLOOKUP(B392,Índices!$A:$H,5,0)),\"\")","v":""},{"$f":"IFERROR(IF(B392=\"\",\"\",VLOOKUP(B392,Índices!$A:$H,6,0)),\"\")","v":""},{"$f":"IFERROR(IF(B392=\"\",\"\",$C$10*VLOOKUP(B392,Índices!$A:$H,7,0)/VLOOKUP(EDATE($C$8,-1),Índices!$A:$H,7,0)),\"\")","v":""},{"$f":"IFERROR(IF(B392=\"\",\"\",E392*(VLOOKUP(B392,Índices!$A:$H,8,0)-VLOOKUP(EDATE($C$8,-1),Índices!$A:$H,8,0))),\"\")","v":""},null,"vazia"]
[null,{"$f":"IFERROR(IF(EDATE($C$8,372)>$C$9,\"\",IF(EDATE($C$8,372)>DATE(2099,12,1),\"\",EDATE($C$8,372))),\"\")","v":""},{"$f":"IFERROR(IF(B393=\"\",\"\",VLOOKUP(B393,Índices!$A:$H,5,0)),\"\")","v":""},{"$f":"IFERROR(IF(B393=\"\",\"\",VLOOKUP(B393,Índices!$A:$H,6,0)),\"\")","v":""},{"$f":"IFERROR(IF(B393=\"\",\"\",$C$10*VLOOKUP(B393,Índices!$A:$H,7,0)/VLOOKUP(EDATE($C$8,-1),Índices!$A:$H,7,0)),\"\")","v":""},{"$f":"IFERROR(IF(B393=\"\",\"\",E393*(VLOOKUP(B393,Índices!$A:$H,8,0)-VLOOKUP(EDATE($C$8,-1),Índices!$A:$H,8,0))),\"\")","v":""},null,"vazia"]
[null,{"$f":"IFERROR(IF(EDATE($C$8,373)>$C$9,\"\",IF(EDATE($C$8,373)>DATE(2099,12,1),\"\",EDATE($C$8,373))),\"\")","v":""},{"$f":"IFERROR(IF(B394=\"\",\"\",VLOOKUP(B394,Índices!$A:$H,5,0)),\"\")","v":""},{"$f":"IFERROR(IF(B394=\"\",\"\",VLOOKUP(B394,Índices!$A:$H,6,0)),\"\")","v":""},{"$f":"IFERROR(IF(B394=\"\",\"\",$C$10*VLOOKUP(B394,Índices!$A:$H,7,0)/VLOOKUP(EDATE($C$8,-1),Índices!$A:$H,7,0)),\"\")","v":""},{"$f":"IFERROR(IF(B394=\"\",\"\",E394*(VLOOKUP(B394,Índices!$A:$H,8,0)-VLOOKUP(EDATE($C$8,-1),Índices!$A:$H,8,0))),\"\")","v":""},null,"vazia"]
[null,{"$f":"IFERROR(IF(EDATE($C$8,374)>$C$9,\"\",IF(EDATE($C$8,374)>DATE(2099,12,1),\"\",EDATE($C$8,374))),\"\")","v":""},{"$f":"IFERROR(IF(B395=\"\",\"\",VLOOKUP(B395,Índices!$A:$H,5,0)),\"\")","v":""},{"$f":"IFERROR(IF(B395=\"\",\"\",VLOOKUP(B395,Índices!$A:$H,6,0)),\"\")","v":""},{"$f":"IFERROR(IF(B395=\"\",\"\",$C$10*VLOOKUP(B395,Índices!$A:$H,7,0)/VLOOKUP(EDATE($C$8,-1),Índices!$A:$H,7,0)),\"\")","v":""},{"$f":"IFERROR(IF(B395=\"\",\"\",E395*(VLOOKUP(B395,Índices!$A:$H,8,0)-VLOOKUP(EDATE($C$8,-1),Índices!$A:$H,8,0))),\"\")","v":""},null,"vazia"]
[null,{"$f":"IFERROR(IF(EDATE($C$8,375)>$C$9,\"\",IF(EDATE($C$8,375)>DATE(2099,12,1),\"\",EDATE($C$8,375))),\"\")","v":""},{"$f":"IFERROR(IF(B396=\"\",\"\",VLOOKUP(B396,Índices!$A:$H,5,0)),\"\")","v":""},{"$f":"IFERROR(IF(B396=\"\",\"\",VLOOKUP(B396,Índices!$A:$H,6,0)),\"\")","v":""},{"$f":"IFERROR(IF(B396=\"\",\"\",$C$10*VLOOKUP(B396,Índices!$A:$H,7,0)/VLOOKUP(EDATE($C$8,-1),Índices!$A:$H,7,0)),\"\")","v":""},{"$f":"IFERROR(IF(B396=\"\",\"\",E396*(VLOOKUP(B396,Índices!$A:$H,8,0)-VLOOKUP(EDATE($C$8,-1),Índices!$A:$H,8,0))),\"\")","v":""},null,"vazia"]
[null,{"$f":"IFERROR(IF(EDATE($C$8,376)>$C$9,\"\",IF(EDATE($C$8,376)>DATE(2099,12,1),\"\",EDATE($C$8,376))),\"\")","v":""},{"$f":"IFERROR(IF(B397=\"\",\"\",VLOOKUP(B397,Índices!$A:$H,5,0)),\"\")","v":""},{"$f":"IFERROR(IF(B397=\"\",\"\",VLOOKUP(B397,Índices!$A:$H,6,0)),\"\")","v":""},{"$f":"IFERROR(IF(B397=\"\",\"\",$C$10*VLOOKUP(B397,Índices!$A:$H,7,0)/VLOOKUP(EDATE($C$8,-1),Índices!$A:$H,7,0)),\"\")","v":""},{"$f":"IFERROR(IF(B397=\"\",\"\",E397*(VLOOKUP(B397,Índices!$A:$H,8,0)-VLOOKUP(EDATE($C$8,-1),Índices!$A:$H,8,0))),\"\")","v":""},null,"vazia"]
[null,{"$f":"IFERROR(IF(EDATE($C$8,377)>$C$9,\"\",IF(EDATE($C$8,377)>DATE(2099,12,1),\"\",EDATE($C$8,377))),\"\")","v":""},{"$f":"IFERROR(IF(B398=\"\",\"\",VLOOKUP(B398,Índices!$A:$H,5,0)),\"\")","v":""},{"$f":"IFERROR(IF(B398=\"\",\"\",VLOOKUP(B398,Índices!$A:$H,6,0)),\"\")","v":""},{"$f":"IFERROR(IF(B398=\"\",\"\",$C$10*VLOOKUP(B398,Índices!$A:$H,7,0)/VLOOKUP(EDATE($C$8,-1),Índices!$A:$H,7,0)),\"\")","v":""},{"$f":"IFERROR(IF(B398=\"\",\"\",E398*(VLOOKUP(B398,Índices!$A:$H,8,0)-VLOOKUP(EDATE($C$8,-1),Índices!$A:$H,8,0))),\"\")","v":""},null,"vazia"]
[null,{"$f":"IFERROR(IF(EDATE($C$8,378)>$C$9,\"\",IF(EDATE($C$8,378)>DATE(2099,12,1),\"\",EDATE($C$8,378))),\"\")","v":""},{"$f":"IFERROR(IF(B399=\"\",\"\",VLOOKUP(B399,Índices!$A:$H,5,0)),\"\")","v":""},{"$f":"IFERROR(IF(B399=\"\",\"\",VLOOKUP(B399,Índices!$A:$H,6,0)),\"\")","v":""},{"$f":"IFERROR(IF(B399=\"\",\"\",$C$10*VLOOKUP(B399,Índices!$A:$H,7,0)/VLOOKUP(EDATE($C$8,-1),Índices!$A:$H,7,0)),\"\")","v":""},{"$f":"IFERROR(IF(B399=\"\",\"\",E399*(VLOOKUP(B399,Índices!$A:$H,8,0)-VLOOKUP(EDATE($C$8,-1),Índices!$A:$H,8,0))),\"\")","v":""},null,"vazia"]
[null,{"$f":"IFERROR(IF(EDATE($C$8,379)>$C$9,\"\",IF(EDATE($C$8,379)>DATE(2099,12,1),\"\",EDATE($C$8,379))),\"\")","v":""},{"$f":"IFERROR(IF(B400=\"\",\"\",VLOOKUP(B400,Índices!$A:$H,5,0)),\"\")","v":""},{"$f":"IFERROR(IF(B400=\"\",\"\",VLOOKUP(B400,Índices!$A:$H,6,0)),\"\")","v":""},{"$f":"IFERROR(IF(B400=\"\",\"\",$C$10*VLOOKUP(B400,Índices!$A:$H,7,0)/VLOOKUP(EDATE($C$8,-1),Índices!$A:$H,7,0)),\"\")","v":""},{"$f":"IFERROR(IF(B400=\"\",\"\",E400*(VLOOKUP(B400,Índices!$A:$H,8,0)-VLOOKUP(EDATE($C$8,-1),Índices!$A:$H,8,0))),\"\")","v":""},null,"vazia"]
[null,{"$f":"IFERROR(IF(EDATE($C$8,380)>$C$9,\"\",IF(EDATE($C$8,380)>DATE(2099,12,1),\"\",EDATE($C$8,380))),\"\")","v":""},{"$f":"IFERROR(IF(B401=\"\",\"\",VLOOKUP(B401,Índices!$A:$H,5,0)),\"\")","v":""},{"$f":"IFERROR(IF(B401=\"\",\"\",VLOOKUP(B401,Índices!$A:$H,6,0)),\"\")","v":""},{"$f":"IFERROR(IF(B401=\"\",\"\",$C$10*VLOOKUP(B401,Índices!$A:$H,7,0)/VLOOKUP(EDATE($C$8,-1),Índices!$A:$H,7,0)),\"\")","v":""},{"$f":"IFERROR(IF(B401=\"\",\"\",E401*(VLOOKUP(B401,Índices!$A:$H,8,0)-VLOOKUP(EDATE($C$8,-1),Índices!$A:$H,8,0))),\"\")","v":""},null,"vazia"]
[null,{"$f":"IFERROR(IF(EDATE($C$8,381)>$C$9,\"\",IF(EDATE($C$8,381)>DATE(2099,12,1),\"\",EDATE($C$8,381))),\"\")","v":""},{"$f":"IFERROR(IF(B402=\"\",\"\",VLOOKUP(B402,Índices!$A:$H,5,0)),\"\")","v":""},{"$f":"IFERROR(IF(B402=\"\",\"\",VLOOKUP(B402,Índices!$A:$H,6,0)),\"\")","v":""},{"$f":"IFERROR(IF(B402=\"\",\"\",$C$10*VLOOKUP(B402,Índices!$A:$H,7,0)/VLOOKUP(EDATE($C$8,-1),Índices!$A:$H,7,0)),\"\")","v":""},{"$f":"IFERROR(IF(B402=\"\",\"\",E402*(VLOOKUP(B402,Índices!$A:$H,8,0)-VLOOKUP(EDATE($C$8,-1),Índices!$A:$H,8,0))),\"\")","v":""},null,"vazia"]
[null,{"$f":"IFERROR(IF(EDATE($C$8,382)>$C$9,\"\",IF(EDATE($C$8,382)>DATE(2099,12,1),\"\",EDATE($C$8,382))),\"\")","v":""},{"$f":"IFERROR(IF(B403=\"\",\"\",VLOOKUP(B403,Índices!$A:$H,5,0)),\"\")","v":""},{"$f":"IFERROR(IF(B403=\"\",\"\",VLOOKUP(B403,Índices!$A:$H,6,0)),\"\")","v":""},{"$f":"IFERROR(IF(B403=\"\",\"\",$C$10*VLOOKUP(B403,Índices!$A:$H,7,0)/VLOOKUP(EDATE($C$8,-1),Índices!$A:$H,7,0)),\"\")","v":""},{"$f":"IFERROR(IF(B403=\"\",\"\",E403*(VLOOKUP(B403,Índices!$A:$H,8,0)-VLOOKUP(EDATE($C$8,-1),Índices!$A:$H,8,0))),\"\")","v":""},null,"vazia"]
[null,{"$f":"IFERROR(IF(EDATE($C$8,383)>$C$9,\"\",IF(EDATE($C$8,383)>DATE(2099,12,1),\"\",EDATE($C$8,383))),\"\")","v":""},{"$f":"IFERROR(IF(B404=\"\",\"\",VLOOKUP(B404,Índices!$A:$H,5,0)),\"\")","v":""},{"$f":"IFERROR(IF(B404=\"\",\"\",VLOOKUP(B404,Índices!$A:$H,6,0)),\"\")","v":""},{"$f":"IFERROR(IF(B404=\"\",\"\",$C$10*VLOOKUP(B404,Índices!$A:$H,7,0)/VLOOKUP(EDATE($C$8,-1),Índices!$A:$H,7,0)),\"\")","v":""},{"$f":"IFERROR(IF(B404=\"\",\"\",E404*(VLOOKUP(B404,Índices!$A:$H,8,0)-VLOOKUP(EDATE($C$8,-1),Índices!$A:$H,8,0))),\"\")","v":""},null,"vazia"]
[null,{"$f":"IFERROR(IF(EDATE($C$8,384)>$C$9,\"\",IF(EDATE($C$8,384)>DATE(2099,12,1),\"\",EDATE($C$8,384))),\"\")","v":""},{"$f":"IFERROR(IF(B405=\"\",\"\",VLOOKUP(B405,Índices!$A:$H,5,0)),\"\")","v":""},{"$f":"IFERROR(IF(B405=\"\",\"\",VLOOKUP(B405,Índices!$A:$H,6,0)),\"\")","v":""},{"$f":"IFERROR(IF(B405=\"\",\"\",$C$10*VLOOKUP(B405,Índices!$A:$H,7,0)/VLOOKUP(EDATE($C$8,-1),Índices!$A:$H,7,0)),\"\")","v":""},{"$f":"IFERROR(IF(B405=\"\",\"\",E405*(VLOOKUP(B405,Índices!$A:$H,8,0)-VLOOKUP(EDATE($C$8,-1),Índices!$A:$H,8,0))),\"\")","v":""},null,"vazia"]
[null,{"$f":"IFERROR(IF(EDATE($C$8,385)>$C$9,\"\",IF(EDATE($C$8,385)>DATE(2099,12,1),\"\",EDATE($C$8,385))),\"\")","v":""},{"$f":"IFERROR(IF(B406=\"\",\"\",VLOOKUP(B406,Índices!$A:$H,5,0)),\"\")","v":""},{"$f":"IFERROR(IF(B406=\"\",\"\",VLOOKUP(B406,Índices!$A:$H,6,0)),\"\")","v":""},{"$f":"IFERROR(IF(B406=\"\",\"\",$C$10*VLOOKUP(B406,Índices!$A:$H,7,0)/VLOOKUP(EDATE($C$8,-1),Índices!$A:$H,7,0)),\"\")","v":""},{"$f":"IFERROR(IF(B406=\"\",\"\",E406*(VLOOKUP(B406,Índices!$A:$H,8,0)-VLOOKUP(EDATE($C$8,-1),Índices!$A:$H,8,0))),\"\")","v":""},null,{"$f":"IF(B406=\"\",\"vazia\",\"1\")","v":"vazia"}]
[null,{"$f":"IFERROR(IF(EDATE($C$8,386)>$C$9,\"\",IF(EDATE($C$8,386)>DATE(2099,12,1),\"\",EDATE($C$8,386))),\"\")","v":""},{"$f":"IFERROR(IF(B407=\"\",\"\",VLOOKUP(B407,Índices!$A:$H,5,0)),\"\")","v":""},{"$f":"IFERROR(IF(B407=\"\",\"\",VLOOKUP(B407,Índices!$A:$H,6,0)),\"\")","v":""},{"$f":"IFERROR(IF(B407=\"\",\"\",$C$10*VLOOKUP(B407,Índices!$A:$H,7,0)/VLOOKUP(EDATE($C$8,-1),Índices!$A:$H,7,0)),\"\")","v":""},{"$f":"IFERROR(IF(B407=\"\",\"\",E407*(VLOOKUP(B407,Índices!$A:$H,8,0)-VLOOKUP(EDATE($C$8,-1),Índices!$A:$H,8,0))),\"\")","v":""},null,"vazia"]
[null,{"$f":"IFERROR(IF(EDATE($C$8,387)>$C$9,\"\",IF(EDATE($C$8,387)>DATE(2099,12,1),\"\",EDATE($C$8,387))),\"\")","v":""},{"$f":"IFERROR(IF(B408=\"\",\"\",VLOOKUP(B408,Índices!$A:$H,5,0)),\"\")","v":""},{"$f":"IFERROR(IF(B408=\"\",\"\",VLOOKUP(B408,Índices!$A:$H,6,0)),\"\")","v":""},{"$f":"IFERROR(IF(B408=\"\",\"\",$C$10*VLOOKUP(B408,Índices!$A:$H,7,0)/VLOOKUP(EDATE($C$8,-1),Índices!$A:$H,7,0)),\"\")","v":""},{"$f":"IFERROR(IF(B408=\"\",\"\",E408*(VLOOKUP(B408,Índices!$A:$H,8,0)-VLOOKUP(EDATE($C$8,-1),Índices!$A:$H,8,0))),\"\")","v":""},null,"vazia"]
[null,{"$f":"IFERROR(IF(EDATE($C$8,388)>$C$9,\"\",IF(EDATE($C$8,388)>DATE(2099,12,1),\"\",EDATE($C$8,388))),\"\")","v":""},{"$f":"IFERROR(IF(B409=\"\",\"\",VLOOKUP(B409,Índices!$A:$H,5,0)),\"\")","v":""},{"$f":"IFERROR(IF(B409=\"\",\"\",VLOOKUP(B409,Índices!$A:$H,6,0)),\"\")","v":""},{"$f":"IFERROR(IF(B409=\"\",\"\",$C$10*VLOOKUP(B409,Índices!$A:$H,7,0)/VLOOKUP(EDATE($C$8,-1),Índices!$A:$H,7,0)),\"\")","v":""},{"$f":"IFERROR(IF(B409=\"\",\"\",E409*(VLOOKUP(B409,Índices!$A:$H,8,0)-VLOOKUP(EDATE($C$8,-1),Índices!$A:$H,8,0))),\"\")","v":""},null,"vazia"]
[null,{"$f":"IFERROR(IF(EDATE($C$8,389)>$C$9,\"\",IF(EDATE($C$8,389)>DATE(2099,12,1),\"\",EDATE($C$8,389))),\"\")","v":""},{"$f":"IFERROR(IF(B410=\"\",\"\",VLOOKUP(B410,Índices!$A:$H,5,0)),\"\")","v":""},{"$f":"IFERROR(IF(B410=\"\",\"\",VLOOKUP(B410,Índices!$A:$H,6,0)),\"\")","v":""},{"$f":"IFERROR(IF(B410=\"\",\"\",$C$10*VLOOKUP(B410,Índices!$A:$H,7,0)/VLOOKUP(EDATE($C$8,-1),Índices!$A:$H,7,0)),\"\")","v":""},{"$f":"IFERROR(IF(B410=\"\",\"\",E410*(VLOOKUP(B410,Índices!$A:$H,8,0)-VLOOKUP(EDATE($C$8,-1),Índices!$A:$H,8,0))),\"\")","v":""},null,"vazia"]
[null,{"$f":"IFERROR(IF(EDATE($C$8,390)>$C$9,\"\",IF(EDATE($C$8,390)>DATE(2099,12,1),\"\",EDATE($C$8,390))),\"\")","v":""},{"$f":"IFERROR(IF(B411=\"\",\"\",VLOOKUP(B411,Índices!$A:$H,5,0)),\"\")","v":""},{"$f":"IFERROR(IF(B411=\"\",\"\",VLOOKUP(B411,Índices!$A:$H,6,0)),\"\")","v":""},{"$f":"IFERROR(IF(B411=\"\",\"\",$C$10*VLOOKUP(B411,Índices!$A:$H,7,0)/VLOOKUP(EDATE($C$8,-1),Índices!$A:$H,7,0)),\"\")","v":""},{"$f":"IFERROR(IF(B411=\"\",\"\",E411*(VLOOKUP(B411,Índices!$A:$H,8,0)-VLOOKUP(EDATE($C$8,-1),Índices!$A:$H,8,0))),\"\")","v":""},null,"vazia"]
[null,{"$f":"IFERROR(IF(EDATE($C$8,391)>$C$9,\"\",IF(EDATE($C$8,391)>DATE(2099,12,1),\"\",EDATE($C$8,391))),\"\")","v":""},{"$f":"IFERROR(IF(B412=\"\",\"\",VLOOKUP(B412,Índices!$A:$H,5,0)),\"\")","v":""},{"$f":"IFERROR(IF(B412=\"\",\"\",VLOOKUP(B412,Índices!$A:$H,6,0)),\"\")","v":""},{"$f":"IFERROR(IF(B412=\"\",\"\",$C$10*VLOOKUP(B412,Índices!$A:$H,7,0)/VLOOKUP(EDATE($C$8,-1),Índices!$A:$H,7,0)),\"\")","v":""},{"$f":"IFERROR(IF(B412=\"\",\"\",E412*(VLOOKUP(B412,Índices!$A:$H,8,0)-VLOOKUP(EDATE($C$8,-1),Índices!$A:$H,8,0))),\"\")","v":""},null,"vazia"]
[null,{"$f":"IFERROR(IF(EDATE($C$8,392)>$C$9,\"\",IF(EDATE($C$8,392)>DATE(2099,12,1),\"\",EDATE($C$8,392))),\"\")","v":""},{"$f":"IFERROR(IF(B413=\"\",\"\",VLOOKUP(B413,Índices!$A:$H,5,0)),\"\")","v":""},{"$f":"IFERROR(IF(B413=\"\",\"\",VLOOKUP(B413,Índices!$A:$H,6,0)),\"\")","v":""},{"$f":"IFERROR(IF(B413=\"\",\"\",$C$10*VLOOKUP(B413,Índices!$A:$H,7,0)/VLOOKUP(EDATE($C$8,-1),Índices!$A:$H,7,0)),\"\")","v":""},{"$f":"IFERROR(IF(B413=\"\",\"\",E413*(VLOOKUP(B413,Índices!$A:$H,8,0)-VLOOKUP(EDATE($C$8,-1),Índices!$A:$H,8,0))),\"\")","v":""},null,"vazia"]
[null,{"$f":"IFERROR(IF(EDATE($C$8,393)>$C$9,\"\",IF(EDATE($C$8,393)>DATE(2099,12,1),\"\",EDATE($C$8,393))),\"\")","v":""},{"$f":"IFERROR(IF(B414=\"\",\"\",VLOOKUP(B414,Índices!$A:$H,5,0)),\"\")","v":""},{"$f":"IFERROR(IF(B414=\"\",\"\",VLOOKUP(B414,Índices!$A:$H,6,0)),\"\")","v":""},{"$f":"IFERROR(IF(B414=\"\",\"\",$C$10*VLOOKUP(B414,Índices!$A:$H,7,0)/VLOOKUP(EDATE($C$8,-1),Índices!$A:$H,7,0)),\"\")","v":""},{"$f":"IFERROR(IF(B414=\"\",\"\",E414*(VLOOKUP(B414,Índices!$A:$H,8,0)-VLOOKUP(EDATE($C$8,-1),Índices!$A:$H,8,0))),\"\")","v":""},null,"vazia"]
[null,{"$f":"IFERROR(IF(EDATE($C$8,394)>$C$9,\"\",IF(EDATE($C$8,394)>DATE(2099,12,1),\"\",EDATE($C$8,394))),\"\")","v":""},{"$f":"IFERROR(IF(B415=\"\",\"\",VLOOKUP(B415,Índices!$A:$H,5,0)),\"\")","v":""},{"$f":"IFERROR(IF(B415=\"\",\"\",VLOOKUP(B415,Índices!$A:$H,6,0)),\"\")","v":""},{"$f":"IFERROR(IF(B415=\"\",\"\",$C$10*VLOOKUP(B415,Índices!$A:$H,7,0)/VLOOKUP(EDATE($C$8,-1),Índices!$A:$H,7,0)),\"\")","v":""},{"$f":"IFERROR(IF(B415=\"\",\"\",E415*(VLOOKUP(B415,Índices!$A:$H,8,0)-VLOOKUP(EDATE($C$8,-1),Índices!$A:$H,8,0))),\"\")","v":""},null,"vazia"]
[null,{"$f":"IFERROR(IF(EDATE($C$8,395)>$C$9,\"\",IF(EDATE($C$8,395)>DATE(2099,12,1),\"\",EDATE($C$8,395))),\"\")","v":""},{"$f":"IFERROR(IF(B416=\"\",\"\",VLOOKUP(B416,Índices!$A:$H,5,0)),\"\")","v":""},{"$f":"IFERROR(IF(B416=\"\",\"\",VLOOKUP(B416,Índices!$A:$H,6,0)),\"\")","v":""},{"$f":"IFERROR(IF(B416=\"\",\"\",$C$10*VLOOKUP(B416,Índices!$A:$H,7,0)/VLOOKUP(EDATE($C$8,-1),Índices!$A:$H,7,0)),\"\")","v":""},{"$f":"IFERROR(IF(B416=\"\",\"\",E416*(VLOOKUP(B416,Índices!$A:$H,8,0)-VLOOKUP(EDATE($C$8,-1),Índices!$A:$H,8,0))),\"\")","v":""},null,"vazia"]
[null,{"$f":"IFERROR(IF(EDATE($C$8,396)>$C$9,\"\",IF(EDATE($C$8,396)>DATE(2099,12,1),\"\",EDATE($C$8,396))),\"\")","v":""},{"$f":"IFERROR(IF(B417=\"\",\"\",VLOOKUP(B417,Índices!$A:$H,5,0)),\"\")","v":""},{"$f":"IFERROR(IF(B417=\"\",\"\",VLOOKUP(B417,Índices!$A:$H,6,0)),\"\")","v":""},{"$f":"IFERROR(IF(B417=\"\",\"\",$C$10*VLOOKUP(B417,Índices!$A:$H,7,0)/VLOOKUP(EDATE($C$8,-1),Índices!$A:$H,7,0)),\"\")","v":""},{"$f":"IFERROR(IF(B417=\"\",\"\",E417*(VLOOKUP(B417,Índices!$A:$H,8,0)-VLOOKUP(EDATE($C$8,-1),Índices!$A:$H,8,0))),\"\")","v":""},null,"vazia"]
[null,{"$f":"IFERROR(IF(EDATE($C$8,397)>$C$9,\"\",IF(EDATE($C$8,397)>DATE(2099,12,1),\"\",EDATE($C$8,397))),\"\")","v":""},{"$f":"IFERROR(IF(B418=\"\",\"\",VLOOKUP(B418,Índices!$A:$H,5,0)),\"\")","v":""},{"$f":"IFERROR(IF(B418=\"\",\"\",VLOOKUP(B418,Índices!$A:$H,6,0)),\"\")","v":""},{"$f":"IFERROR(IF(B418=\"\",\"\",$C$10*VLOOKUP(B418,Índices!$A:$H,7,0)/VLOOKUP(EDATE($C$8,-1),Índices!$A:$H,7,0)),\"\")","v":""},{"$f":"IFERROR(IF(B418=\"\",\"\",E418*(VLOOKUP(B418,Índices!$A:$H,8,0)-VLOOKUP(EDATE($C$8,-1),Índices!$A:$H,8,0))),\"\")","v":""},null,"vazia"]
[null,{"$f":"IFERROR(IF(EDATE($C$8,398)>$C$9,\"\",IF(EDATE($C$8,398)>DATE(2099,12,1),\"\",EDATE($C$8,398))),\"\")","v":""},{"$f":"IFERROR(IF(B419=\"\",\"\",VLOOKUP(B419,Índices!$A:$H,5,0)),\"\")","v":""},{"$f":"IFERROR(IF(B419=\"\",\"\",VLOOKUP(B419,Índices!$A:$H,6,0)),\"\")","v":""},{"$f":"IFERROR(IF(B419=\"\",\"\",$C$10*VLOOKUP(B419,Índices!$A:$H,7,0)/VLOOKUP(EDATE($C$8,-1),Índices!$A:$H,7,0)),\"\")","v":""},{"$f":"IFERROR(IF(B419=\"\",\"\",E419*(VLOOKUP(B419,Índices!$A:$H,8,0)-VLOOKUP(EDATE($C$8,-1),Índices!$A:$H,8,0))),\"\")","v":""},null,"vazia"]
[null,{"$f":"IFERROR(IF(EDATE($C$8,399)>$C$9,\"\",IF(EDATE($C$8,399)>DATE(2099,12,1),\"\",EDATE($C$8,399))),\"\")","v":""},{"$f":"IFERROR(IF(B420=\"\",\"\",VLOOKUP(B420,Índices!$A:$H,5,0)),\"\")","v":""},{"$f":"IFERROR(IF(B420=\"\",\"\",VLOOKUP(B420,Índices!$A:$H,6,0)),\"\")","v":""},{"$f":"IFERROR(IF(B420=\"\",\"\",$C$10*VLOOKUP(B420,Índices!$A:$H,7,0)/VLOOKUP(EDATE($C$8,-1),Índices!$A:$H,7,0)),\"\")","v":""},{"$f":"IFERROR(IF(B420=\"\",\"\",E420*(VLOOKUP(B420,Índices!$A:$H,8,0)-VLOOKUP(EDATE($C$8,-1),Índices!$A:$H,8,0))),\"\")","v":""},null,"vazia"]
[null,null,null,null,null,null,null,"vazia"]
[null,"METODOLOGIA APLICADA (NOTA DE RODAPÉ)",null,null,null,null,null,"1"]
[null,"Base legal: Lei Estadual nº 10.654/91 (arts. 86 e 90); Lei 16.226/2017; Decreto 45.708/2018; Lei 13.178/2006 (art. 3); Decisão STF (ADPF/RE – limitação de índices estaduais à União).\n\nPERÍODO 02/2000 a 02/2018 – Taxa SELIC acumulada mensalmente (engloba correção monetária e juros). Valor nominal do crédito e da multa mantidos. No mês do pagamento aplica-se 1% adicional (art. 90, II, b-1, da Lei 10.654/91).\n\nPERÍODO 03/2018 a 09/2023 – Correção monetária: IPCA divulgado no mês (IBGE), utilizando o percentual publicado no mês anterior à aplicação (Decreto 45.708/18, par. único). Juros moratórios: 1% a.m. fixo sobre o total do débito (Lei 16.226/2017).\n\nPERÍODO 10/2023 em diante – Conforme decisão do STF que veda a Estados índices superiores aos federais: (a) Atualização monetária = IPCA limitado ao valor da SELIC; (b) Juros = diferença positiva entre SELIC e IPCA (quando IPCA ≥ SELIC, juros = zero). Fundamento: irretroatividade das normas (princípio 'tempus regit actum') – STJ, EDcl no AgInt no AREsp 948395/RS, DJ 19/08/2019.\n\nINÍCIO DA INCIDÊNCIA – A partir do mês subsequente ao mês de vencimento do crédito (Lei 10.654/91, arts. 86 e 90, §4º; Decreto 45.708/2018, art. 2º). Para crédito não tributário sem legislação específica, o prazo de vencimento é de 10 dias a contar da intimação do TCC (Lei 13.178/2006, art. 3º).\n\nIRRETROATIVIDADE – As normas de correção e juros aplicam-se apenas a partir de sua vigência, nunca retroativamente, mesmo quando mais benéficas (STJ, EDcl no AgInt no AREsp 948395/RS).\n\nElaborado com base na Nota Técnica nº 2/2026 – Diretoria de Sistemas Corporativos Tributários – SEFAZ/PE, assinada por Afranio Cavalcante Silva em 10/03/2026.",null,null,null,null,null,"1"]
[null,null,null,null,null,null,null,"vazia"]
[null,null,null,null,null,null,null,"vazia"]
[null,null,null,null,null,null,null,"vazia"]
[null,null,null,null,null,null,null,"vazia"]
[null,null,null,null,null,null,null,"vazia"]
[null,null,null,null,null,null,null,"vazia"]
[null,null,null,null,null,null,null,"vazia"]
[null,null,null,null,null,null,null,"vazia"]
[null,null,null,null,null,null,null,"vazia"]
[null,null,null,null,null,null,null,"vazia"]
[null,null,null,null,null,null,null,"vazia"]
[null,null,null,null,null,null,null,"vazia"]
[null,null,null,null,null,null,null,"vazia"]
[null,null,null,null,null,null,null,"vazia"]
[null,null,null,null,null,null,null,"vazia"]
[null,null,null,null,null,null,null,"vazia"]
[null,null,null,null,null,null,null,"vazia"]
[null,null,null,null,null,null,null,"vazia"]
[null,null,null,null,null,null,null,"vazia"]
[null,null,null,null,null,null,null,"vazia"]
[null,null,null,null,null,null,null,"vazia"]
[null,null,null,null,null,null,null,"vazia"]
[null,null,null,null,null,null,null,"vazia"]
[null,null,null,null,null,null,null,"vazia"]
[null,null,null,null,null,null,null,"vazia"]
[null,null,null,null,null,null,null,"vazia"]
[null,null,null,null,null,null,null,"vazia"]
[null,null,null,null,null,null,null,"vazia"]
[null,null,null,null,null,null,null,"vazia"]
[null,null,null,null,null,null,null,"vazia"]
[null,null,null,null,null,null,null,"vazia"]
[null,null,null,null,null,null,null,"vazia"]
[null,null,null,null,null,null,null,"vazia"]
[null,null,null,null,null,null,null,"vazia"]
[null,null,null,null,null,null,null,"vazia"]
[null,null,null,null,null,null,null,"vazia"]
[null,null,null,null,null,null,null,"vazia"]
[null,null,null,null,null,null,null,"vazia"]
[null,null,null,null,null,null,null,"vazia"]
[null,null,null,null,null,null,null,"vazia"]
[null,null,null,null,null,null,null,"vazia"]
[null,null,null,null,null,null,null,"vazia"]
[null,null,null,null,null,null,null,"vazia"]
[null,null,null,null,null,null,null,"vazia"]
[null,null,null,null,null,null,null,"vazia"]
[null,null,null,null,null,null,null,"vazia"]
[null,null,null,null,null,null,null,{"$f":"IF(B470=\"\",\"vazia\",\"1\")","v":"vazia"}]
[null,null,null,null,null,null,null,"vazia"]
[null,null,null,null,null,null,null,"vazia"]
[null,null,null,null,null,null,null,"vazia"]
[null,null,null,null,null,null,null,"vazia"]
[null,null,null,null,null,null,null,"vazia"]
[null,null,null,null,null,null,null,"vazia"]
[null,null,null,null,null,null,null,"vazia"]
[null,null,null,null,null,null,null,"vazia"]
[null,null,null,null,null,null,null,"vazia"]
[null,null,null,null,null,null,null,"vazia"]
[null,null,null,null,null,null,null,"vazia"]
[null,null,null,null,null,null,null,"vazia"]
[null,null,null,null,null,null,null,"vazia"]
[null,null,null,null,null,null,null,"vazia"]
[null,null,null,null,null,null,null,"vazia"]
[null,null,null,null,null,null,null,"vazia"]
[null,null,null,null,null,null,null,"vazia"]
[null,null,null,null,null,null,null,"vazia"]
[null,null,null,null,null,null,null,"vazia"]
[null,null,null,null,null,null,null,"vazia"]
[null,null,null,null,null,null,null,"vazia"]
[null,null,null,null,null,null,null,"vazia"]
[null,null,null,null,null,null,null,"vazia"]
[null,null,null,null,null,null,null,"vazia"]
[null,null,null,null,null,null,null,"vazia"]
[null,null,null,null,null,null,null,"vazia"]
[null,null,null,null,null,null,null,"vazia"]
[null,null,null,null,null,null,null,"vazia"]
[null,null,null,null,null,null,null,"vazia"]
[null,null,null,null,null,null,null,"vazia"]
[null,null,null,null,null,null,null,"vazia"]

{"sheet":"atualização","index":2,"n_rows":124,"n_cols":5,"rows_kept":124,"cut":false,"hidden":true,"merged":[[123,0,123,4],[0,0,0,4],[116,0,116,4],[122,0,122,4],[118,0,118,4],[119,0,119,4],[121,0,121,4],[3,0,3,4],[1,0,1,4],[120,0,120,4],[115,0,115,4],[117,0,117,4]]}
["ÍNDICES SELIC E IPCA – ATUALIZAÇÃO MONETÁRIA"]
["Período: 01/01/2026 a 31/12/2034  |  Fonte: BCB (SELIC – Série 4390) e IBGE (IPCA)  |  Atualização automática via macro ao abrir"]
[]
["⚠  INSTRUÇÕES: Esta aba é alimentada automaticamente pela macro ao abrir a planilha. Os valores já preenchidos são os dados oficiais publicados. Para meses futuros ainda não divulgados, insira manualmente a SELIC (% a.m.) e o IPCA (% a.m.) nas colunas B e C."]
[]
["Mês/Ano","SELIC (% a.m.)","IPCA (% a.m.)","Fonte SELIC","Fonte IPCA"]
["2026-01-01",1.1599999999999999E-2,3.3E-3,"BCB Oficial","IBGE/IPCA Mensal"]
["2026-02-01",0.01,6.9999999999999993E-3,"BCB Oficial","IBGE/IPCA Mensal"]
["2026-03-01",1.21E-2,8.8000000000000005E-3,"BCB Oficial","IBGE/IPCA Mensal"]
["2026-04-01",1.09E-2,6.7000000000000002E-3,"BCB Oficial","IBGE/IPCA Mensal"]
["2026-05-01",1.0700000000000001E-2,5.7999999999999996E-3,"BCB Oficial","IBGE/IPCA Mensal"]
["2026-06-01",1.1200000000000002E-2,null,"BCB Oficial","Não divulgado"]
["2026-07-01",5.0000000000000001E-4,null,"BCB Oficial","Não divulgado"]
["2026-08-01",null,null,"Não divulgado","Não divulgado"]
["2026-09-01",null,null,"Não divulgado","Não divulgado"]
["2026-10-01",null,null,"Não divulgado","Não divulgado"]
["2026-11-01",null,null,"Não divulgado","Não divulgado"]
["2026-12-01",null,null,"Não divulgado","Não divulgado"]
["2027-01-01",null,null,"Não divulgado","Não divulgado"]
["2027-02-01",null,null,"Não divulgado","Não divulgado"]
["2027-03-01",null,null,"Não divulgado","Não divulgado"]
["2027-04-01",null,null,"Não divulgado","Não divulgado"]
["2027-05-01",null,null,"Não divulgado","Não divulgado"]
["2027-06-01",null,null,"Não divulgado","Não divulgado"]
["2027-07-01",null,null,"Não divulgado","Não divulgado"]
["2027-08-01",null,null,"Não divulgado","Não divulgado"]
["2027-09-01",null,null,"Não divulgado","Não divulgado"]
["2027-10-01",null,null,"Não divulgado","Não divulgado"]
["2027-11-01",null,null,"Não divulgado","Não divulgado"]
["2027-12-01",null,null,"Não divulgado","Não divulgado"]
["2028-01-01",null,null,"Não divulgado","Não divulgado"]
["2028-02-01",null,null,"Não divulgado","Não divulgado"]
["2028-03-01",null,null,"Não divulgado","Não divulgado"]
["2028-04-01",null,null,"Não divulgado","Não divulgado"]
["2028-05-01",null,null,"Não divulgado","Não divulgado"]
["2028-06-01",null,null,"Não divulgado","Não divulgado"]
["2028-07-01",null,null,"Não divulgado","Não divulgado"]
["2028-08-01",null,null,"Não divulgado","Não divulgado"]
["2028-09-01",null,null,"Não divulgado","Não divulgado"]
["2028-10-01",null,null,"Não divulgado","Não divulgado"]
["2028-11-01",null,null,"Não divulgado","Não divulgado"]
["2028-12-01",null,null,"Não divulgado","Não divulgado"]
["2029-01-01",null,null,"Não divulgado","Não divulgado"]
["2029-02-01",null,null,"Não divulgado","Não divulgado"]
["2029-03-01",null,null,"Não divulgado","Não divulgado"]
["2029-04-01",null,null,"Não divulgado","Não divulgado"]
["2029-05-01",null,null,"Não divulgado","Não divulgado"]
["2029-06-01",null,null,"Não divulgado","Não divulgado"]
["2029-07-01",null,null,"Não divulgado","Não divulgado"]
["2029-08-01",null,null,"Não divulgado","Não divulgado"]
["2029-09-01",null,null,"Não divulgado","Não divulgado"]
["2029-10-01",null,null,"Não divulgado","Não divulgado"]
["2029-11-01",null,null,"Não divulgado","Não divulgado"]
["2029-12-01",null,null,"Não divulgado","Não divulgado"]
["2030-01-01",null,null,"Não divulgado","Não divulgado"]
["2030-02-01",null,null,"Não divulgado","Não divulgado"]
["2030-03-01",null,null,"Não divulgado","Não divulgado"]
["2030-04-01",null,null,"Não divulgado","Não divulgado"]
["2030-05-01",null,null,"Não divulgado","Não divulgado"]
["2030-06-01",null,null,"Não divulgado","Não divulgado"]
["2030-07-01",null,null,"Não divulgado","Não divulgado"]
["2030-08-01",null,null,"Não divulgado","Não divulgado"]
["2030-09-01",null,null,"Não divulgado","Não divulgado"]
["2030-10-01",null,null,"Não divulgado","Não divulgado"]
["2030-11-01",null,null,"Não divulgado","Não divulgado"]
["2030-12-01",null,null,"Não divulgado","Não divulgado"]
["2031-01-01",null,null,"Não divulgado","Não divulgado"]
["2031-02-01",null,null,"Não divulgado","Não divulgado"]
["2031-03-01",null,null,"Não divulgado","Não divulgado"]
["2031-04-01",null,null,"Não divulgado","Não divulgado"]
["2031-05-01",null,null,"Não divulgado","Não divulgado"]
["2031-06-01",null,null,"Não divulgado","Não divulgado"]
["2031-07-01",null,null,"Não divulgado","Não divulgado"]
["2031-08-01",null,null,"Não divulgado","Não divulgado"]
["2031-09-01",null,null,"Não divulgado","Não divulgado"]
["2031-10-01",null,null,"Não divulgado","Não divulgado"]
["2031-11-01",null,null,"Não divulgado","Não divulgado"]
["2031-12-01",null,null,"Não divulgado","Não divulgado"]
["2032-01-01",null,null,"Não divulgado","Não divulgado"]
["2032-02-01",null,null,"Não divulgado","Não divulgado"]
["2032-03-01",null,null,"Não divulgado","Não divulgado"]
["2032-04-01",null,null,"Não divulgado","Não divulgado"]
["2032-05-01",null,null,"Não divulgado","Não divulgado"]
["2032-06-01",null,null,"Não divulgado","Não divulgado"]
["2032-07-01",null,null,"Não divulgado","Não divulgado"]
["2032-08-01",null,null,"Não divulgado","Não divulgado"]
["2032-09-01",null,null,"Não divulgado","Não divulgado"]
["2032-10-01",null,null,"Não divulgado","Não divulgado"]
["2032-11-01",null,null,"Não divulgado","Não divulgado"]
["2032-12-01",null,null,"Não divulgado","Não divulgado"]
["2033-01-01",null,null,"Não divulgado","Não divulgado"]
["2033-02-01",null,null,"Não divulgado","Não divulgado"]
["2033-03-01",null,null,"Não divulgado","Não divulgado"]
["2033-04-01",null,null,"Não divulgado","Não divulgado"]
["2033-05-01",null,null,"Não divulgado","Não divulgado"]
["2033-06-01",null,null,"Não divulgado","Não divulgado"]
["2033-07-01",null,null,"Não divulgado","Não divulgado"]
["2033-08-01",null,null,"Não divulgado","Não divulgado"]
["2033-09-01",null,null,"Não divulgado","Não divulgado"]
["2033-10-01",null,null,"Não divulgado","Não divulgado"]
["2033-11-01",null,null,"Não divulgado","Não divulgado"]
["2033-12-01",null,null,"Não divulgado","Não divulgado"]
["2034-01-01",null,null,"Não divulgado","Não divulgado"]
["2034-02-01",null,null,"Não divulgado","Não divulgado"]
["2034-03-01",null,null,"Não divulgado","Não divulgado"]
["2034-04-01",null,null,"Não divulgado","Não divulgado"]
["2034-05-01",null,null,"Não divulgado","Não divulgado"]
["2034-06-01",null,null,"Não divulgado","Não divulgado"]
["2034-07-01",null,null,"Não divulgado","Não divulgado"]
["2034-08-01",null,null,"Não divulgado","Não divulgado"]
["2034-09-01",null,null,"Não divulgado","Não divulgado"]
["2034-10-01",null,null,"Não divulgado","Não divulgado"]
["2034-11-01",null,null,"Não divulgado","Não divulgado"]
["2034-12-01",null,null,"Não divulgado","Não divulgado"]
[]
["LEGENDA:"]
["Verde: valor oficial já publicado e confirmado"]
["📋  COMO ATIVAR A ATUALIZAÇÃO AUTOMÁTICA (Macro VBA)"]
["1. Salve este arquivo como .xlsm (Arquivo → Salvar Como → Pasta de Trabalho Habilitada para Macro do Excel)"]
["2. Pressione Alt+F11 para abrir o Editor VBA"]
["3. Clique com botão direito em 'VBAProject' → Inserir → Módulo"]
["4. Cole o código do arquivo 'macro_atualizar_indices.bas' (baixe junto com esta planilha)"]
["5. Feche o editor e salve. A macro 'AtualizarIndices' estará disponível em Desenvolvedor → Macros"]
["6. Execute a macro sempre que precisar atualizar os índices (requer internet)"]

{"sheet":"Índices","index":3,"n_rows":428,"n_cols":9,"rows_kept":428,"cut":false,"hidden":true,"merged":[[427,0,427,7],[2,0,2,7],[1,0,1,7]]}
[]
["TABELA DE ÍNDICES – SELIC, IPCA, ATUALIZAÇÃO E JUROS (02/2000 em diante)"]
["Fonte: Planilha de Apoio DSC/SEFAZ-PE (Nota Técnica nº 2/2026). Para atualizar: insira novos meses nas linhas seguintes com os índices SELIC e IPCA; as colunas Atualização e Juros são calculadas automaticamente."]
["Mês/Ano","SELIC (%)","IPCA (%)","Regime","Índice Acum. Correção","Índice Acum. Juros","Fator Corr. Acumulado","Fator Juros Acumulado"]
["2000-02-01",1.4500000000000001E-2,null,"SELIC",0,1.46E-2,{"$f":"1+E5","v":1},{"$f":"F5","v":1.46E-2}]
["2000-03-01",1.4500000000000001E-2,null,"SELIC",0,1.4500000000000001E-2,{"$f":"G5*(1+E6)","v":1},{"$f":"H5+F6","v":2.9100000000000001E-2}]
["2000-04-01",1.2999999999999999E-2,null,"SELIC",0,1.4500000000000001E-2,1,4.36E-2]
["2000-05-01",1.49E-2,null,"SELIC",0,1.2999999999999999E-2,1,5.6599999999999998E-2]
["2000-06-01",1.3899999999999999E-2,null,"SELIC",0,1.49E-2,1,7.1499999999999994E-2]
["2000-07-01",1.3100000000000001E-2,null,"SELIC",0,1.3899999999999999E-2,1,8.539999999999999E-2]
["2000-08-01",1.41E-2,null,"SELIC",0,1.3100000000000001E-2,1,9.849999999999999E-2]
["2000-09-01",1.2200000000000001E-2,null,"SELIC",0,1.41E-2,1,0.11259999999999999]
["2000-10-01",1.29E-2,null,"SELIC",0,1.2200000000000001E-2,1,0.12479999999999999]
["2000-11-01",1.2200000000000001E-2,null,"SELIC",0,1.29E-2,1,0.13769999999999999]
["2000-12-01",1.2E-2,null,"SELIC",0,1.2200000000000001E-2,1,0.14989999999999998]
["2001-01-01",1.2699999999999999E-2,null,"SELIC",0,1.2E-2,1,0.16189999999999999]
["2001-02-01",1.0200000000000001E-2,null,"SELIC",0,1.2699999999999999E-2,1,0.17459999999999998]
["2001-03-01",1.26E-2,null,"SELIC",0,1.0200000000000001E-2,1,0.18479999999999996]
["2001-04-01",1.1900000000000001E-2,null,"SELIC",0,1.26E-2,1,0.19739999999999996]
["2001-05-01",1.34E-2,null,"SELIC",0,1.1900000000000001E-2,1,0.20929999999999996]
["2001-06-01",1.2699999999999999E-2,null,"SELIC",0,1.34E-2,1,0.22269999999999995]
["2001-07-01",1.4999999999999999E-2,null,"SELIC",0,1.2699999999999999E-2,1,0.23539999999999994]
["2001-08-01",1.6E-2,null,"SELIC",0,1.4999999999999999E-2,1,0.25039999999999996]
["2001-09-01",1.32E-2,null,"SELIC",0,1.6E-2,1,0.26639999999999997]
["2001-10-01",1.5299999999999999E-2,null,"SELIC",0,1.32E-2,1,0.27959999999999996]
["2001-11-01",1.3899999999999999E-2,null,"SELIC",0,1.5299999999999999E-2,1,0.29489999999999994]
["2001-12-01",1.3899999999999999E-2,null,"SELIC",0,1.3899999999999999E-2,1,0.30879999999999996]
["2002-01-01",1.5299999999999999E-2,null,"SELIC",0,1.3899999999999999E-2,1,0.32269999999999999]
["2002-02-01",1.2500000000000001E-2,null,"SELIC",0,1.5299999999999999E-2,1,0.33799999999999997]
["2002-03-01",1.37E-2,null,"SELIC",0,1.2500000000000001E-2,1,0.35049999999999998]
["2002-04-01",1.4800000000000001E-2,null,"SELIC",0,1.37E-2,1,0.36419999999999997]
["2002-05-01",1.41E-2,null,"SELIC",0,1.4800000000000001E-2,1,0.37899999999999995]
["2002-06-01",1.3299999999999999E-2,null,"SELIC",0,1.41E-2,1,0.39309999999999995]
["2002-07-01",1.54E-2,null,"SELIC",0,1.3299999999999999E-2,1,0.40639999999999993]
["2002-08-01",1.44E-2,null,"SELIC",0,1.54E-2,1,0.42179999999999995]
["2002-09-01",1.38E-2,null,"SELIC",0,1.44E-2,1,0.43619999999999998]
["2002-10-01",1.6500000000000001E-2,null,"SELIC",0,1.38E-2,1,0.44999999999999996]
["2002-11-01",1.54E-2,null,"SELIC",0,1.6500000000000001E-2,1,0.46649999999999997]
["2002-12-01",1.7399999999999999E-2,null,"SELIC",0,1.54E-2,1,0.4819]
["2003-01-01",1.9699999999999999E-2,null,"SELIC",0,1.7399999999999999E-2,1,0.49929999999999997]
["2003-02-01",1.83E-2,null,"SELIC",0,1.9699999999999999E-2,1,0.51900000000000002]
["2003-03-01",1.78E-2,null,"SELIC",0,1.83E-2,1,0.5373]
["2003-04-01",1.8700000000000001E-2,null,"SELIC",0,1.78E-2,1,0.55510000000000004]
["2003-05-01",1.9699999999999999E-2,null,"SELIC",0,1.8700000000000001E-2,1,0.57380000000000009]
["2003-06-01",1.8599999999999998E-2,null,"SELIC",0,1.9699999999999999E-2,1,0.59350000000000014]
["2003-07-01",2.0799999999999999E-2,null,"SELIC",0,1.8599999999999998E-2,1,0.61210000000000009]
["2003-08-01",1.77E-2,null,"SELIC",0,2.0799999999999999E-2,1,0.63290000000000013]
["2003-09-01",1.6799999999999999E-2,null,"SELIC",0,1.77E-2,1,0.65060000000000018]
["2003-10-01",1.6400000000000001E-2,null,"SELIC",0,1.6799999999999999E-2,1,0.66740000000000022]
["2003-11-01",1.34E-2,null,"SELIC",0,1.6400000000000001E-2,1,0.68380000000000019]
["2003-12-01",1.37E-2,null,"SELIC",0,1.34E-2,1,0.69720000000000015]
["2004-01-01",1.2699999999999999E-2,null,"SELIC",0,1.37E-2,1,0.7109000000000002]
["2004-02-01",1.0800000000000001E-2,null,"SELIC",0,1.2699999999999999E-2,1,0.72360000000000024]
["2004-03-01",1.38E-2,null,"SELIC",0,1.0800000000000001E-2,1,0.73440000000000027]
["2004-04-01",1.18E-2,null,"SELIC",0,1.38E-2,1,0.74820000000000031]
["2004-05-01",1.23E-2,null,"SELIC",0,1.18E-2,1,0.76000000000000034]
["2004-06-01",1.23E-2,null,"SELIC",0,1.23E-2,1,0.77230000000000032]
["2004-07-01",1.29E-2,null,"SELIC",0,1.23E-2,1,0.7846000000000003]
["2004-08-01",1.29E-2,null,"SELIC",0,1.29E-2,1,0.79750000000000032]
["2004-09-01",1.2500000000000001E-2,null,"SELIC",0,1.29E-2,1,0.81040000000000034]
["2004-10-01",1.21E-2,null,"SELIC",0,1.2500000000000001E-2,1,0.8229000000000003]
["2004-11-01",1.2500000000000001E-2,null,"SELIC",0,1.21E-2,1,0.8350000000000003]
["2004-12-01",1.4800000000000001E-2,null,"SELIC",0,1.2500000000000001E-2,1,0.84750000000000025]
["2005-01-01",1.38E-2,null,"SELIC",0,1.4800000000000001E-2,1,0.86230000000000029]
["2005-02-01",1.2200000000000001E-2,null,"SELIC",0,1.38E-2,1,0.87610000000000032]
["2005-03-01",1.5299999999999999E-2,null,"SELIC",0,1.2200000000000001E-2,1,0.88830000000000031]
["2005-04-01",1.41E-2,null,"SELIC",0,1.5299999999999999E-2,1,0.90360000000000029]
["2005-05-01",1.4999999999999999E-2,null,"SELIC",0,1.41E-2,1,0.91770000000000029]
["2005-06-01",1.5900000000000001E-2,null,"SELIC",0,1.4999999999999999E-2,1,0.93270000000000031]
["2005-07-01",1.5100000000000001E-2,null,"SELIC",0,1.5900000000000001E-2,{"$f":"G69*(1+E70)","v":1},{"$f":"H69+F70","v":0.94860000000000033}]
["2005-08-01",1.66E-2,null,"SELIC",0,1.5100000000000001E-2,1,0.96370000000000033]
["2005-09-01",1.4999999999999999E-2,null,"SELIC",0,1.66E-2,1,0.98030000000000028]
["2005-10-01",1.41E-2,null,"SELIC",0,1.4999999999999999E-2,1,0.9953000000000003]
["2005-11-01",1.38E-2,null,"SELIC",0,1.41E-2,1,1.0094000000000003]
["2005-12-01",1.47E-2,null,"SELIC",0,1.38E-2,1,1.0232000000000003]
["2006-01-01",1.43E-2,null,"SELIC",0,1.47E-2,1,1.0379000000000003]
["2006-02-01",1.14E-2,null,"SELIC",0,1.43E-2,1,1.0522000000000002]
["2006-03-01",1.4200000000000001E-2,null,"SELIC",0,1.14E-2,1,1.0636000000000003]
["2006-04-01",1.0800000000000001E-2,null,"SELIC",0,1.4200000000000001E-2,1,1.0778000000000003]
["2006-05-01",1.2800000000000001E-2,null,"SELIC",0,1.0800000000000001E-2,1,1.0886000000000002]
["2006-06-01",1.18E-2,null,"SELIC",0,1.2800000000000001E-2,1,1.1014000000000002]
["2006-07-01",1.17E-2,null,"SELIC",0,1.18E-2,1,1.1132000000000002]
["2006-08-01",1.26E-2,null,"SELIC",0,1.17E-2,1,1.1249000000000002]
["2006-09-01",1.06E-2,null,"SELIC",0,1.26E-2,1,1.1375000000000002]
["2006-10-01",1.09E-2,null,"SELIC",0,1.06E-2,1,1.1481000000000001]
["2006-11-01",1.0200000000000001E-2,null,"SELIC",0,1.09E-2,1,1.159]
["2006-12-01",9.9000000000000008E-3,null,"SELIC",0,1.0200000000000001E-2,1,1.1692]
["2007-01-01",1.0800000000000001E-2,null,"SELIC",0,9.9000000000000008E-3,1,1.1791]
["2007-02-01",8.6999999999999994E-3,null,"SELIC",0,1.0800000000000001E-2,1,1.1899]
["2007-03-01",1.0500000000000001E-2,null,"SELIC",0,8.6999999999999994E-3,1,1.1985999999999999]
["2007-04-01",9.4000000000000004E-3,null,"SELIC",0,1.0500000000000001E-2,1,1.2090999999999998]
["2007-05-01",1.03E-2,null,"SELIC",0,9.4000000000000004E-3,1,1.2184999999999999]
["2007-06-01",9.1000000000000004E-3,null,"SELIC",0,1.03E-2,1,1.2287999999999999]
["2007-07-01",9.7000000000000003E-3,null,"SELIC",0,9.1000000000000004E-3,1,1.2379]
["2007-08-01",9.9000000000000008E-3,null,"SELIC",0,9.7000000000000003E-3,1,1.2476]
["2007-09-01",8.0000000000000002E-3,null,"SELIC",0,9.9000000000000008E-3,1,1.2575000000000001]
["2007-10-01",9.2999999999999992E-3,null,"SELIC",0,8.0000000000000002E-3,1,1.2655000000000001]
["2007-11-01",8.3999999999999995E-3,null,"SELIC",0,9.2999999999999992E-3,1,1.2748000000000002]
["2007-12-01",8.3999999999999995E-3,null,"SELIC",0,8.3999999999999995E-3,1,1.2832000000000001]
["2008-01-01",9.2999999999999992E-3,null,"SELIC",0,8.3999999999999995E-3,1,1.2916000000000001]
["2008-02-01",8.0000000000000002E-3,null,"SELIC",0,9.2999999999999992E-3,1,1.3009000000000002]
["2008-03-01",8.3999999999999995E-3,null,"SELIC",0,8.0000000000000002E-3,1,1.3089000000000002]
["2008-04-01",8.9999999999999993E-3,null,"SELIC",0,8.3999999999999995E-3,1,1.3173000000000001]
["2008-05-01",8.8000000000000005E-3,null,"SELIC",0,8.9999999999999993E-3,1,1.3263]
["2008-06-01",9.5999999999999992E-3,null,"SELIC",0,8.8000000000000005E-3,1,1.3351]
["2008-07-01",1.0699999999999999E-2,null,"SELIC",0,9.5999999999999992E-3,1,1.3447]
["2008-08-01",1.0200000000000001E-2,null,"SELIC",0,1.0699999999999999E-2,1,1.3553999999999999]
["2008-09-01",1.0999999999999999E-2,null,"SELIC",0,1.0200000000000001E-2,1,1.3655999999999999]
["2008-10-01",1.18E-2,null,"SELIC",0,1.0999999999999999E-2,1,1.3765999999999998]
["2008-11-01",1.0200000000000001E-2,null,"SELIC",0,1.18E-2,1,1.3883999999999999]
["2008-12-01",1.12E-2,null,"SELIC",0,1.0200000000000001E-2,1,1.3985999999999998]
["2009-01-01",1.0500000000000001E-2,null,"SELIC",0,1.12E-2,1,1.4097999999999999]
["2009-02-01",8.6E-3,null,"SELIC",0,1.0500000000000001E-2,1,1.4202999999999999]
["2009-03-01",9.7000000000000003E-3,null,"SELIC",0,8.6E-3,1,1.4288999999999998]
["2009-04-01",8.3999999999999995E-3,null,"SELIC",0,9.7000000000000003E-3,1,1.4385999999999999]
["2009-05-01",7.7000000000000002E-3,null,"SELIC",0,8.3999999999999995E-3,1,1.4469999999999998]
["2009-06-01",7.6E-3,null,"SELIC",0,7.7000000000000002E-3,1,1.4546999999999999]
["2009-07-01",7.9000000000000008E-3,null,"SELIC",0,7.6E-3,1,1.4622999999999999]
["2009-08-01",6.8999999999999999E-3,null,"SELIC",0,7.9000000000000008E-3,1,1.4702]
["2009-09-01",6.8999999999999999E-3,null,"SELIC",0,6.8999999999999999E-3,1,1.4770999999999999]
["2009-10-01",6.8999999999999999E-3,null,"SELIC",0,6.8999999999999999E-3,1,1.4839999999999998]
["2009-11-01",6.6E-3,null,"SELIC",0,6.8999999999999999E-3,1,1.4908999999999997]
["2009-12-01",7.3000000000000001E-3,null,"SELIC",0,6.6E-3,1,1.4974999999999996]
["2010-01-01",6.6E-3,null,"SELIC",0,7.3000000000000001E-3,1,1.5047999999999997]
["2010-02-01",5.8999999999999999E-3,null,"SELIC",0,6.6E-3,1,1.5113999999999996]
["2010-03-01",7.6E-3,null,"SELIC",0,5.8999999999999999E-3,1,1.5172999999999996]
["2010-04-01",6.7000000000000002E-3,null,"SELIC",0,7.6E-3,1,1.5248999999999997]
["2010-05-01",7.4999999999999997E-3,null,"SELIC",0,6.7000000000000002E-3,1,1.5315999999999996]
["2010-06-01",7.9000000000000008E-3,null,"SELIC",0,7.4999999999999997E-3,1,1.5390999999999997]
["2010-07-01",8.6E-3,null,"SELIC",0,7.9000000000000008E-3,1,1.5469999999999997]
["2010-08-01",8.8999999999999999E-3,null,"SELIC",0,8.6E-3,1,1.5555999999999996]
["2010-09-01",8.5000000000000006E-3,null,"SELIC",0,8.8999999999999999E-3,1,1.5644999999999996]
["2010-10-01",8.0999999999999996E-3,null,"SELIC",0,8.5000000000000006E-3,1,1.5729999999999995]
["2010-11-01",8.0999999999999996E-3,null,"SELIC",0,8.0999999999999996E-3,{"$f":"G133*(1+E134)","v":1},{"$f":"H133+F134","v":1.5810999999999995}]
["2010-12-01",9.2999999999999992E-3,null,"SELIC",0,8.0999999999999996E-3,1,1.5891999999999995]
["2011-01-01",8.6E-3,null,"SELIC",0,9.2999999999999992E-3,1,1.5984999999999996]
["2011-02-01",8.3999999999999995E-3,null,"SELIC",0,8.6E-3,1,1.6070999999999995]
["2011-03-01",9.1999999999999998E-3,null,"SELIC",0,8.3999999999999995E-3,1,1.6154999999999995]
["2011-04-01",8.3999999999999995E-3,null,"SELIC",0,9.1999999999999998E-3,1,1.6246999999999996]
["2011-05-01",9.9000000000000008E-3,null,"SELIC",0,8.3999999999999995E-3,1,1.6330999999999996]
["2011-06-01",9.5999999999999992E-3,null,"SELIC",0,9.9000000000000008E-3,1,1.6429999999999996]
["2011-07-01",9.7000000000000003E-3,null,"SELIC",0,9.5999999999999992E-3,1,1.6525999999999996]
["2011-08-01",1.0699999999999999E-2,null,"SELIC",0,9.7000000000000003E-3,1,1.6622999999999997]
["2011-09-01",9.4000000000000004E-3,null,"SELIC",0,1.0699999999999999E-2,1,1.6729999999999996]
["2011-10-01",8.8000000000000005E-3,null,"SELIC",0,9.4000000000000004E-3,1,1.6823999999999997]
["2011-11-01",8.6E-3,null,"SELIC",0,8.8000000000000005E-3,1,1.6911999999999996]
["2011-12-01",9.1000000000000004E-3,null,"SELIC",0,8.6E-3,1,1.6997999999999995]
["2012-01-01",8.8999999999999999E-3,null,"SELIC",0,9.1000000000000004E-3,1,1.7088999999999996]
["2012-02-01",7.4999999999999997E-3,null,"SELIC",0,8.8999999999999999E-3,1,1.7177999999999995]
["2012-03-01",8.2000000000000007E-3,null,"SELIC",0,7.4999999999999997E-3,1,1.7252999999999996]
["2012-04-01",7.1000000000000004E-3,null,"SELIC",0,8.2000000000000007E-3,1,1.7334999999999996]
["2012-05-01",7.4000000000000003E-3,null,"SELIC",0,7.1000000000000004E-3,1,1.7405999999999997]
["2012-06-01",6.4000000000000003E-3,null,"SELIC",0,7.4000000000000003E-3,1,1.7479999999999998]
["2012-07-01",6.7999999999999996E-3,null,"SELIC",0,6.4000000000000003E-3,1,1.7543999999999997]
["2012-08-01",6.8999999999999999E-3,null,"SELIC",0,6.7999999999999996E-3,1,1.7611999999999997]
["2012-09-01",5.4000000000000003E-3,null,"SELIC",0,6.8999999999999999E-3,1,1.7680999999999996]
["2012-10-01",6.1000000000000004E-3,null,"SELIC",0,5.4000000000000003E-3,1,1.7734999999999996]
["2012-11-01",5.4999999999999997E-3,null,"SELIC",0,6.1000000000000004E-3,1,1.7795999999999996]
["2012-12-01",5.4999999999999997E-3,null,"SELIC",0,5.4999999999999997E-3,1,1.7850999999999997]
["2013-01-01",6.0000000000000001E-3,null,"SELIC",0,5.4999999999999997E-3,1,1.7905999999999997]
["2013-02-01",4.8999999999999998E-3,null,"SELIC",0,6.0000000000000001E-3,1,1.7965999999999998]
["2013-03-01",5.4999999999999997E-3,null,"SELIC",0,4.8999999999999998E-3,1,1.8014999999999997]
["2013-04-01",6.1000000000000004E-3,null,"SELIC",0,5.4999999999999997E-3,1,1.8069999999999997]
["2013-05-01",6.0000000000000001E-3,null,"SELIC",0,6.1000000000000004E-3,1,1.8130999999999997]
["2013-06-01",6.1000000000000004E-3,null,"SELIC",0,6.0000000000000001E-3,1,1.8190999999999997]
["2013-07-01",7.1999999999999998E-3,null,"SELIC",0,6.1000000000000004E-3,1,1.8251999999999997]
["2013-08-01",7.1000000000000004E-3,null,"SELIC",0,7.1999999999999998E-3,1,1.8323999999999998]
["2013-09-01",7.1000000000000004E-3,null,"SELIC",0,7.1000000000000004E-3,1,1.8394999999999999]
["2013-10-01",8.0999999999999996E-3,null,"SELIC",0,7.1000000000000004E-3,1,1.8466]
["2013-11-01",7.1999999999999998E-3,null,"SELIC",0,8.0999999999999996E-3,1,1.8547]
["2013-12-01",7.9000000000000008E-3,null,"SELIC",0,7.1999999999999998E-3,1,1.8619000000000001]
["2014-01-01",8.5000000000000006E-3,null,"SELIC",0,7.9000000000000008E-3,1,1.8698000000000001]
["2014-02-01",7.9000000000000008E-3,null,"SELIC",0,8.5000000000000006E-3,1,1.8783000000000001]
["2014-03-01",7.7000000000000002E-3,null,"SELIC",0,7.9000000000000008E-3,1,1.8862000000000001]
["2014-04-01",8.2000000000000007E-3,null,"SELIC",0,7.7000000000000002E-3,1,1.8939000000000001]
["2014-05-01",8.6999999999999994E-3,null,"SELIC",0,8.2000000000000007E-3,1,1.9021000000000001]
["2014-06-01",8.2000000000000007E-3,null,"SELIC",0,8.6999999999999994E-3,1,1.9108000000000001]
["2014-07-01",9.4999999999999998E-3,null,"SELIC",0,8.2000000000000007E-3,1,1.919]
["2014-08-01",8.6999999999999994E-3,null,"SELIC",0,9.4999999999999998E-3,1,1.9285000000000001]
["2014-09-01",9.1000000000000004E-3,null,"SELIC",0,8.6999999999999994E-3,1,1.9372]
["2014-10-01",9.4999999999999998E-3,null,"SELIC",0,9.1000000000000004E-3,1,1.9463000000000001]
["2014-11-01",8.3999999999999995E-3,null,"SELIC",0,9.4999999999999998E-3,1,1.9558000000000002]
["2014-12-01",9.5999999999999992E-3,null,"SELIC",0,8.3999999999999995E-3,1,1.9642000000000002]
["2015-01-01",9.4000000000000004E-3,null,"SELIC",0,9.5999999999999992E-3,1,1.9738000000000002]
["2015-02-01",8.2000000000000007E-3,null,"SELIC",0,9.4000000000000004E-3,1,1.9832000000000003]
["2015-03-01",1.04E-2,null,"SELIC",0,8.2000000000000007E-3,1,1.9914000000000003]
["2015-04-01",9.4999999999999998E-3,null,"SELIC",0,1.04E-2,1,2.0018000000000002]
["2015-05-01",9.9000000000000008E-3,null,"SELIC",0,9.4999999999999998E-3,1,2.0113000000000003]
["2015-06-01",1.0699999999999999E-2,null,"SELIC",0,9.9000000000000008E-3,1,2.0212000000000003]
["2015-07-01",1.18E-2,null,"SELIC",0,1.0699999999999999E-2,1,2.0319000000000003]
["2015-08-01",1.11E-2,null,"SELIC",0,1.18E-2,1,2.0437000000000003]
["2015-09-01",1.11E-2,null,"SELIC",0,1.11E-2,1,2.0548000000000002]
["2015-10-01",1.11E-2,null,"SELIC",0,1.11E-2,1,2.0659000000000001]
["2015-11-01",1.06E-2,null,"SELIC",0,1.11E-2,1,2.077]
["2015-12-01",1.1599999999999999E-2,null,"SELIC",0,1.06E-2,1,2.0876000000000001]
["2016-01-01",1.06E-2,null,"SELIC",0,1.1599999999999999E-2,1,2.0992000000000002]
["2016-02-01",0.01,null,"SELIC",0,1.06E-2,1,2.1098000000000003]
["2016-03-01",1.1599999999999999E-2,null,"SELIC",0,0.01,{"$f":"G197*(1+E198)","v":1},{"$f":"H197+F198","v":2.1198000000000001}]
["2016-04-01",1.06E-2,null,"SELIC",0,1.1599999999999999E-2,1,2.1314000000000002]
["2016-05-01",1.11E-2,null,"SELIC",0,1.06E-2,1,2.1420000000000003]
["2016-06-01",1.1599999999999999E-2,null,"SELIC",0,1.11E-2,1,2.1531000000000002]
["2016-07-01",1.11E-2,null,"SELIC",0,1.1599999999999999E-2,1,2.1647000000000003]
["2016-08-01",1.2200000000000001E-2,null,"SELIC",0,1.11E-2,1,2.1758000000000002]
["2016-09-01",1.11E-2,null,"SELIC",0,1.2200000000000001E-2,1,2.1880000000000002]
["2016-10-01",1.0500000000000001E-2,null,"SELIC",0,1.11E-2,1,2.1991000000000001]
["2016-11-01",1.04E-2,null,"SELIC",0,1.0500000000000001E-2,1,2.2096]
["2016-12-01",1.12E-2,null,"SELIC",0,1.04E-2,1,2.2200000000000002]
["2017-01-01",1.09E-2,null,"SELIC",0,1.12E-2,1,2.2312000000000003]
["2017-02-01",8.6999999999999994E-3,null,"SELIC",0,1.09E-2,1,2.2421000000000002]
["2017-03-01",1.0500000000000001E-2,null,"SELIC",0,8.6999999999999994E-3,1,2.2508000000000004]
["2017-04-01",7.9000000000000008E-3,null,"SELIC",0,1.0500000000000001E-2,1,2.2613000000000003]
["2017-05-01",9.2999999999999992E-3,null,"SELIC",0,7.9000000000000008E-3,1,2.2692000000000001]
["2017-06-01",8.0999999999999996E-3,null,"SELIC",0,9.2999999999999992E-3,1,2.2785000000000002]
["2017-07-01",8.0000000000000002E-3,null,"SELIC",0,8.0999999999999996E-3,1,2.2866000000000004]
["2017-08-01",8.0000000000000002E-3,null,"SELIC",0,8.0000000000000002E-3,1,2.2946000000000004]
["2017-09-01",6.4000000000000003E-3,null,"SELIC",0,8.0000000000000002E-3,1,2.3026000000000004]
["2017-10-01",6.4000000000000003E-3,null,"SELIC",0,6.4000000000000003E-3,1,2.3090000000000006]
["2017-11-01",5.7000000000000002E-3,null,"SELIC",0,6.4000000000000003E-3,1,2.3154000000000008]
["2017-12-01",5.4000000000000003E-3,null,"SELIC",0,5.7000000000000002E-3,1,2.3211000000000008]
["2018-01-01",5.7999999999999996E-3,null,"SELIC",0,5.4000000000000003E-3,1,2.3265000000000007]
["2018-02-01",4.7000000000000002E-3,3.2000000000000002E-3,"SELIC",0,5.7999999999999996E-3,1,2.3323000000000005]
["2018-03-01",5.3E-3,8.9999999999999998E-4,"IPCA+1%",0,1.47E-2,1,2.3470000000000004]
["2018-04-01",5.1999999999999998E-3,2.2000000000000001E-3,"IPCA+1%",3.2000000000000002E-3,0.01,1.0032000000000001,2.3570000000000002]
["2018-05-01",5.1999999999999998E-3,4.0000000000000001E-3,"IPCA+1%",8.9999999999999998E-4,0.01,1.00410288,2.367]
["2018-06-01",5.1999999999999998E-3,1.26E-2,"IPCA+1%",2.2000000000000001E-3,0.01,1.006311906336,2.3769999999999998]
["2018-07-01",5.4000000000000003E-3,3.3E-3,"IPCA+1%",4.0000000000000001E-3,0.01,1.0103371539613439,2.3869999999999996]
["2018-08-01",5.7000000000000002E-3,-8.9999999999999998E-4,"IPCA+1%",1.26E-2,0.01,1.0230674021012569,2.3969999999999994]
["2018-09-01",4.7000000000000002E-3,4.7999999999999996E-3,"IPCA+1%",3.3E-3,0.01,1.0264435245281911,2.4069999999999991]
["2018-10-01",5.4000000000000003E-3,4.4999999999999997E-3,"IPCA+1%",-8.9999999999999998E-4,0.01,1.0255197253561157,2.4169999999999989]
["2018-11-01",4.8999999999999998E-3,-2.0999999999999999E-3,"IPCA+1%",4.7999999999999996E-3,0.01,1.0304422200378249,2.4269999999999987]
["2018-12-01",4.8999999999999998E-3,1.5E-3,"IPCA+1%",4.4999999999999997E-3,0.01,1.0350792100279951,2.4369999999999985]
["2019-01-01",5.4000000000000003E-3,3.2000000000000002E-3,"IPCA+1%",-2.0999999999999999E-3,0.01,1.0329055436869363,2.4469999999999983]
["2019-02-01",4.8999999999999998E-3,4.3E-3,"IPCA+1%",1.5E-3,0.01,1.0344549020024667,2.4569999999999981]
["2019-03-01",4.7000000000000002E-3,7.4999999999999997E-3,"IPCA+1%",3.2000000000000002E-3,0.01,1.0377651576888747,2.4669999999999979]
["2019-04-01",5.1999999999999998E-3,5.7000000000000002E-3,"IPCA+1%",4.3E-3,0.01,1.0422275478669367,2.4769999999999976]
["2019-05-01",5.4000000000000003E-3,1.2999999999999999E-3,"IPCA+1%",7.4999999999999997E-3,0.01,1.0500442544759387,2.4869999999999974]
["2019-06-01",4.7000000000000002E-3,1E-4,"IPCA+1%",5.7000000000000002E-3,0.01,1.0560295067264516,2.4969999999999972]
["2019-07-01",5.7000000000000002E-3,1.9E-3,"IPCA+1%",1.2999999999999999E-3,0.01,1.0574023450851961,2.506999999999997]
["2019-08-01",5.0000000000000001E-3,1.1000000000000001E-3,"IPCA+1%",1E-4,0.01,1.0575080853197047,2.5169999999999968]
["2019-09-01",4.5999999999999999E-3,-4.0000000000000002E-4,"IPCA+1%",1.9E-3,0.01,1.0595173506818123,2.5269999999999966]
["2019-10-01",4.7999999999999996E-3,1E-3,"IPCA+1%",1.1000000000000001E-3,0.01,1.0606828197675624,2.5369999999999964]
["2019-11-01",3.8E-3,5.1000000000000004E-3,"IPCA+1%",-4.0000000000000002E-4,0.01,1.0602585466396555,2.5469999999999962]
["2019-12-01",3.7000000000000002E-3,1.15E-2,"IPCA+1%",1E-3,0.01,1.061318805186295,2.5569999999999959]
["2020-01-01",3.8E-3,2.0999999999999999E-3,"IPCA+1%",5.1000000000000004E-3,0.01,1.0667315310927452,2.5669999999999957]
["2020-02-01",2.8999999999999998E-3,2.5000000000000001E-3,"IPCA+1%",1.15E-2,0.01,1.0789989437003118,2.5769999999999955]
["2020-03-01",3.3999999999999998E-3,6.9999999999999999E-4,"IPCA+1%",2.0999999999999999E-3,0.01,1.0812648414820825,2.5869999999999953]
["2020-04-01",2.8E-3,-3.0999999999999999E-3,"IPCA+1%",2.5000000000000001E-3,0.01,1.0839680035857877,2.5969999999999951]
["2020-05-01",2.3999999999999998E-3,-3.8E-3,"IPCA+1%",6.9999999999999999E-4,0.01,1.0847267811882977,2.6069999999999949]
["2020-06-01",2.0999999999999999E-3,2.5999999999999999E-3,"IPCA+1%",-3.0999999999999999E-3,0.01,1.081364128166614,2.6169999999999947]
["2020-07-01",1.9E-3,3.5999999999999999E-3,"IPCA+1%",-3.8E-3,0.01,1.0772549444795809,2.6269999999999945]
["2020-08-01",1.6000000000000001E-3,2.3999999999999998E-3,"IPCA+1%",2.5999999999999999E-3,0.01,1.0800558073352278,2.6369999999999942]
["2020-09-01",1.6000000000000001E-3,6.4000000000000003E-3,"IPCA+1%",3.5999999999999999E-3,0.01,1.0839440082416347,2.646999999999994]
["2020-10-01",1.6000000000000001E-3,8.6E-3,"IPCA+1%",2.3999999999999998E-3,0.01,1.0865454738614146,2.6569999999999938]
["2020-11-01",1.5E-3,8.8999999999999999E-3,"IPCA+1%",6.4000000000000003E-3,0.01,1.0934993648941276,2.6669999999999936]
["2020-12-01",1.6000000000000001E-3,1.35E-2,"IPCA+1%",8.6E-3,0.01,1.1029034594322169,2.6769999999999934]
["2021-01-01",1.5E-3,2.5000000000000001E-3,"IPCA+1%",8.8999999999999999E-3,0.01,1.1127193002211635,2.6869999999999932]
["2021-02-01",1.2999999999999999E-3,8.6E-3,"IPCA+1%",1.35E-2,0.01,1.1277410107741492,2.696999999999993]
["2021-03-01",2E-3,9.2999999999999992E-3,"IPCA+1%",2.5000000000000001E-3,0.01,1.1305603633010846,2.7069999999999927]
["2021-04-01",2.0999999999999999E-3,3.0999999999999999E-3,"IPCA+1%",8.6E-3,0.01,1.1402831824254738,2.7169999999999925]
["2021-05-01",2.7000000000000001E-3,8.3000000000000001E-3,"IPCA+1%",9.2999999999999992E-3,0.01,1.1508878160220308,2.7269999999999923]
["2021-06-01",3.0999999999999999E-3,5.3E-3,"IPCA+1%",3.0999999999999999E-3,0.01,1.1544555682516993,2.7369999999999921]
["2021-07-01",3.5999999999999999E-3,9.5999999999999992E-3,"IPCA+1%",8.3000000000000001E-3,0.01,{"$f":"G261*(1+E262)","v":1.1640375494681883},{"$f":"H261+F262","v":2.7469999999999919}]
["2021-08-01",4.3E-3,8.6999999999999994E-3,"IPCA+1%",5.3E-3,0.01,1.1702069484803697,2.7569999999999917]
["2021-09-01",4.4000000000000003E-3,1.1599999999999999E-2,"IPCA+1%",9.5999999999999992E-3,0.01,1.1814409351857813,2.7669999999999915]
["2021-10-01",4.8999999999999998E-3,1.2500000000000001E-2,"IPCA+1%",8.6999999999999994E-3,0.01,1.1917194713218975,2.7769999999999913]
["2021-11-01",5.8999999999999999E-3,9.4999999999999998E-3,"IPCA+1%",1.1599999999999999E-2,0.01,1.2055434171892316,2.786999999999991]
["2021-12-01",7.7000000000000002E-3,7.3000000000000001E-3,"IPCA+1%",1.2500000000000001E-2,0.01,1.2206127099040969,2.7969999999999908]
["2022-01-01",7.3000000000000001E-3,5.4000000000000003E-3,"IPCA+1%",9.4999999999999998E-3,0.01,1.2322085306481858,2.8069999999999906]
["2022-02-01",7.6E-3,1.01E-2,"IPCA+1%",7.3000000000000001E-3,0.01,1.2412036529219177,2.8169999999999904]
["2022-03-01",9.2999999999999992E-3,1.6199999999999999E-2,"IPCA+1%",5.4000000000000003E-3,0.01,1.2479061526476962,2.8269999999999902]
["2022-04-01",8.3000000000000001E-3,1.06E-2,"IPCA+1%",1.01E-2,0.01,1.260510004789438,2.83699999999999]
["2022-05-01",1.03E-2,4.7000000000000002E-3,"IPCA+1%",1.6199999999999999E-2,0.01,1.2809302668670268,2.8469999999999898]
["2022-06-01",1.0200000000000001E-2,6.7000000000000002E-3,"IPCA+1%",1.06E-2,0.01,1.2945081276958172,2.8569999999999895]
["2022-07-01",1.03E-2,-6.7999999999999996E-3,"IPCA+1%",4.7000000000000002E-3,0.01,1.3005923158959876,2.8669999999999893]
["2022-08-01",1.17E-2,-3.5999999999999999E-3,"IPCA+1%",6.7000000000000002E-3,0.01,1.3093062844124905,2.8769999999999891]
["2022-09-01",1.0699999999999999E-2,-2.8999999999999998E-3,"IPCA+1%",-6.7999999999999996E-3,0.01,1.3004030016784855,2.8869999999999889]
["2022-10-01",1.0200000000000001E-2,5.8999999999999999E-3,"IPCA+1%",-3.5999999999999999E-3,0.01,1.2957215508724429,2.8969999999999887]
["2022-11-01",1.0200000000000001E-2,4.1000000000000003E-3,"IPCA+1%",-2.8999999999999998E-3,0.01,1.2919639583749127,2.9069999999999885]
["2022-12-01",1.12E-2,6.1999999999999998E-3,"IPCA+1%",5.8999999999999999E-3,0.01,1.2995865457293247,2.9169999999999883]
["2023-01-01",1.12E-2,5.3E-3,"IPCA+1%",4.1000000000000003E-3,0.01,1.3049148505668149,2.9269999999999881]
["2023-02-01",9.1999999999999998E-3,8.3999999999999995E-3,"IPCA+1%",6.1999999999999998E-3,0.01,1.3130053226403291,2.9369999999999878]
["2023-03-01",1.17E-2,7.1000000000000004E-3,"IPCA+1%",5.3E-3,0.01,1.3199642508503229,2.9469999999999876]
["2023-04-01",9.1999999999999998E-3,6.1000000000000004E-3,"IPCA+1%",8.3999999999999995E-3,0.01,1.3310519505574656,2.9569999999999874]
["2023-05-01",1.12E-2,2.3E-3,"IPCA+1%",7.1000000000000004E-3,0.01,1.3405024194064237,2.9669999999999872]
["2023-06-01",1.0699999999999999E-2,-8.0000000000000004E-4,"IPCA+1%",6.1000000000000004E-3,0.01,1.3486794841648029,2.976999999999987]
["2023-07-01",1.0699999999999999E-2,1.1999999999999999E-3,"IPCA+1%",2.3E-3,0.01,1.351781446978382,2.9869999999999868]
["2023-08-01",1.14E-2,2.3E-3,"IPCA+1%",-8.0000000000000004E-4,0.01,1.3507000218207992,2.9969999999999866]
["2023-09-01",9.7000000000000003E-3,2.5999999999999999E-3,"IPCA+1%",1.1999999999999999E-3,0.01,1.3523208618469842,3.0069999999999864]
["2023-10-01",0.01,2.3999999999999998E-3,"IPCA≤SELIC / SELIC-IPCA",{"$f":"IFERROR(MIN(B288,C287),0)","v":2.3E-3},{"$f":"IFERROR(MAX(B288-C287,0),0)","v":7.4000000000000003E-3},1.3554311998292321,3.0143999999999864]
["2023-11-01",9.1999999999999998E-3,2.8E-3,"IPCA≤SELIC / SELIC-IPCA",{"$f":"IFERROR(MIN(B289,C288),0)","v":2.5999999999999999E-3},{"$f":"IFERROR(MAX(B289-C288,0),0)","v":7.4000000000000003E-3},1.3589553209487881,3.0217999999999865]
["2023-12-01",8.8999999999999999E-3,5.5999999999999999E-3,"IPCA≤SELIC / SELIC-IPCA",{"$f":"IFERROR(MIN(B290,C289),0)","v":2.3999999999999998E-3},{"$f":"IFERROR(MAX(B290-C289,0),0)","v":6.8000000000000005E-3},1.3622168137190651,3.0285999999999866]
["2024-01-01",9.7000000000000003E-3,4.1999999999999997E-3,"IPCA≤SELIC / SELIC-IPCA",{"$f":"IFERROR(MIN(B291,C290),0)","v":2.8E-3},6.0999999999999995E-3,1.3660310207974784,3.0346999999999866]
["2024-02-01",8.0000000000000002E-3,8.3000000000000001E-3,"IPCA≤SELIC / SELIC-IPCA",5.5999999999999999E-3,4.1000000000000003E-3,1.3736807945139444,3.0387999999999868]
["2024-03-01",8.3000000000000001E-3,1.6000000000000001E-3,"IPCA≤SELIC / SELIC-IPCA",4.1999999999999997E-3,3.8000000000000004E-3,1.379450253850903,3.0425999999999869]
["2024-04-01",8.8999999999999999E-3,3.8E-3,"IPCA≤SELIC / SELIC-IPCA",8.3000000000000001E-3,0,1.3908996909578655,3.0425999999999869]
["2024-05-01",8.3000000000000001E-3,4.5999999999999999E-3,"IPCA≤SELIC / SELIC-IPCA",1.6000000000000001E-3,7.3000000000000001E-3,1.393125130463398,3.0498999999999867]
["2024-06-01",7.9000000000000008E-3,2.0999999999999999E-3,"IPCA≤SELIC / SELIC-IPCA",3.8E-3,4.5000000000000005E-3,1.398419005959159,3.0543999999999869]
["2024-07-01",9.1000000000000004E-3,3.8E-3,"IPCA≤SELIC / SELIC-IPCA",4.5999999999999999E-3,3.3000000000000008E-3,1.4048517333865711,3.0576999999999868]
["2024-08-01",8.6999999999999994E-3,-2.0000000000000001E-4,"IPCA≤SELIC / SELIC-IPCA",2.0999999999999999E-3,7.000000000000001E-3,1.4078019220266829,3.0646999999999869]
["2024-09-01",8.3999999999999995E-3,4.4000000000000003E-3,"IPCA≤SELIC / SELIC-IPCA",3.8E-3,4.8999999999999998E-3,1.4131515693303842,3.069599999999987]
["2024-10-01",9.2999999999999992E-3,5.5999999999999999E-3,"IPCA≤SELIC / SELIC-IPCA",-2.0000000000000001E-4,8.6E-3,1.4128689390165181,3.0781999999999869]
["2024-11-01",7.9000000000000008E-3,3.8999999999999998E-3,"IPCA≤SELIC / SELIC-IPCA",4.4000000000000003E-3,4.899999999999999E-3,1.4190855623481908,3.0830999999999871]
["2024-12-01",9.2999999999999992E-3,5.1999999999999998E-3,"IPCA≤SELIC / SELIC-IPCA",{"$f":"IFERROR(MIN(B302,C301),0)","v":5.5999999999999999E-3},2.3000000000000008E-3,1.4270324414973408,3.085399999999987]
["2025-01-01",1.01E-2,1.6000000000000001E-3,"IPCA≤SELIC / SELIC-IPCA",{"$f":"IFERROR(MIN(B303,C302),0)","v":3.8999999999999998E-3},5.3999999999999994E-3,1.4325978680191804,3.0907999999999869,{"$f":"G306/G304-1","v":6.8083200000002009E-3}]
["2025-02-01",9.9000000000000008E-3,1.3100000000000001E-2,"IPCA≤SELIC / SELIC-IPCA",{"$f":"IFERROR(MIN(B304,C303),0)","v":5.1999999999999998E-3},4.8999999999999998E-3,1.4400473769328803,3.095699999999987]
["2025-03-01",9.5999999999999992E-3,5.5999999999999999E-3,"IPCA≤SELIC / SELIC-IPCA",1.6000000000000001E-3,8.3000000000000001E-3,1.4423514527359731,3.1039999999999872]
["2025-04-01",1.06E-2,4.3E-3,"IPCA≤SELIC / SELIC-IPCA",9.5999999999999992E-3,0,1.4561980266822385,3.1039999999999872]
["2025-05-01",1.14E-2,2.5999999999999999E-3,"IPCA≤SELIC / SELIC-IPCA",5.5999999999999999E-3,5.0000000000000001E-3,1.464352735631659,3.1089999999999871]
["2025-06-01",1.0999999999999999E-2,2.3999999999999998E-3,"IPCA≤SELIC / SELIC-IPCA",4.3E-3,7.1000000000000004E-3,1.4706494523948752,3.116099999999987]
["2025-07-01",1.2800000000000001E-2,2.5999999999999999E-3,"IPCA≤SELIC / SELIC-IPCA",2.5999999999999999E-3,8.3999999999999995E-3,1.4744731409711018,3.124499999999987]
["2025-08-01",1.1599999999999999E-2,-1.1000000000000001E-3,"IPCA≤SELIC / SELIC-IPCA",2.3999999999999998E-3,1.0400000000000001E-2,1.4780118765094323,3.1348999999999871]
["2025-09-01",1.2200000000000001E-2,4.7999999999999996E-3,"IPCA≤SELIC / SELIC-IPCA",2.5999999999999999E-3,8.9999999999999993E-3,1.4818547073883568,3.143899999999987]
["2025-10-01",1.2800000000000001E-2,8.9999999999999998E-4,"IPCA≤SELIC / SELIC-IPCA",-1.1000000000000001E-3,1.3300000000000001E-2,1.4802246672102297,3.1571999999999871]
["2025-11-01",1.0500000000000001E-2,1.8E-3,"IPCA≤SELIC / SELIC-IPCA",4.7999999999999996E-3,8.0000000000000002E-3,1.4873297456128387,3.1651999999999871]
["2025-12-01",1.2200000000000001E-2,3.3E-3,"IPCA≤SELIC / SELIC-IPCA",8.9999999999999998E-4,9.6000000000000009E-3,1.48866834238389,3.174799999999987]
["2026-01-01",{"$f":"IF(VLOOKUP(A316,atualização!A$7:C$114,2,0)=0,\"\",(VLOOKUP(A316,atualização!A$7:C$114,2,0)))","v":1.1599999999999999E-2},{"$f":"IF(VLOOKUP(A316,atualização!A$7:C$114,3,0)=0,\"\",(VLOOKUP(A316,atualização!A$7:C$114,3,0)))","v":3.3E-3},"IPCA≤SELIC / SELIC-IPCA",1.8E-3,1.0400000000000001E-2,1.491347945400181,3.1851999999999872]
["2026-02-01",{"$f":"IF(VLOOKUP(A317,atualização!A$7:C$114,2,0)=0,\"\",(VLOOKUP(A317,atualização!A$7:C$114,2,0)))","v":0.01},{"$f":"IF(VLOOKUP(A317,atualização!A$7:C$114,3,0)=0,\"\",(VLOOKUP(A317,atualização!A$7:C$114,3,0)))","v":6.9999999999999993E-3},"IPCA≤SELIC / SELIC-IPCA",3.3E-3,8.2999999999999984E-3,1.4962693936200018,3.1934999999999873]
["2026-03-01",{"$f":"IF(VLOOKUP(A318,atualização!A$7:C$114,2,0)=0,\"\",(VLOOKUP(A318,atualização!A$7:C$114,2,0)))","v":1.21E-2},{"$f":"IF(VLOOKUP(A318,atualização!A$7:C$114,3,0)=0,\"\",(VLOOKUP(A318,atualização!A$7:C$114,3,0)))","v":8.8000000000000005E-3},"IPCA≤SELIC / SELIC-IPCA",3.3E-3,6.7000000000000002E-3,1.5012070826189479,3.2001999999999873]
["2026-04-01",{"$f":"IF(VLOOKUP(A319,atualização!A$7:C$114,2,0)=0,\"\",(VLOOKUP(A319,atualização!A$7:C$114,2,0)))","v":1.09E-2},{"$f":"IF(VLOOKUP(A319,atualização!A$7:C$114,3,0)=0,\"\",(VLOOKUP(A319,atualização!A$7:C$114,3,0)))","v":6.7000000000000002E-3},"IPCA≤SELIC / SELIC-IPCA",6.9999999999999993E-3,5.1000000000000004E-3,1.5117155321972804,{"$f":"IFERROR(H318+(1+H318)*F319,G318)","v":3.2216210199999873}]
["2026-05-01",{"$f":"IF(VLOOKUP(A320,atualização!A$7:C$114,2,0)=0,\"\",(VLOOKUP(A320,atualização!A$7:C$114,2,0)))","v":1.0700000000000001E-2},{"$f":"IF(VLOOKUP(A320,atualização!A$7:C$114,3,0)=0,\"\",(VLOOKUP(A320,atualização!A$7:C$114,3,0)))","v":5.7999999999999996E-3},"IPCA≤SELIC / SELIC-IPCA",8.8000000000000005E-3,2.0999999999999994E-3,1.5250186288806162,3.2304864241419873]
["2026-06-01",{"$f":"IF(VLOOKUP(A321,atualização!A$7:C$114,2,0)=0,\"\",(VLOOKUP(A321,atualização!A$7:C$114,2,0)))","v":1.1200000000000002E-2},{"$f":"IF(VLOOKUP(A321,atualização!A$7:C$114,3,0)=0,\"\",(VLOOKUP(A321,atualização!A$7:C$114,3,0)))","v":""},"IPCA≤SELIC / SELIC-IPCA",6.7000000000000002E-3,4.000000000000001E-3,1.5352362536941162,3.2474083698385554]
["2026-07-01",{"$f":"IF(VLOOKUP(A322,atualização!A$7:C$114,2,0)=0,\"\",(VLOOKUP(A322,atualização!A$7:C$114,2,0)))","v":5.0000000000000001E-4},{"$f":"IF(VLOOKUP(A322,atualização!A$7:C$114,3,0)=0,\"\",(VLOOKUP(A322,atualização!A$7:C$114,3,0)))","v":""},"IPCA≤SELIC / SELIC-IPCA",5.7999999999999996E-3,5.400000000000002E-3,1.5441406239655422,3.2703443750356835]
["2026-08-01",{"$f":"IF(VLOOKUP(A323,atualização!A$7:C$114,2,0)=0,\"\",(VLOOKUP(A323,atualização!A$7:C$114,2,0)))","v":""},{"$f":"IF(VLOOKUP(A323,atualização!A$7:C$114,3,0)=0,\"\",(VLOOKUP(A323,atualização!A$7:C$114,3,0)))","v":""},"IPCA≤SELIC / SELIC-IPCA",5.0000000000000001E-4,0,1.5449126942775249,3.2703443750356835]
["2026-09-01",{"$f":"IF(VLOOKUP(A324,atualização!A$7:C$114,2,0)=0,\"\",(VLOOKUP(A324,atualização!A$7:C$114,2,0)))","v":""},{"$f":"IF(VLOOKUP(A324,atualização!A$7:C$114,3,0)=0,\"\",(VLOOKUP(A324,atualização!A$7:C$114,3,0)))","v":""},"IPCA≤SELIC / SELIC-IPCA",0,0,1.5449126942775249,3.2703443750356835]
["2026-10-01",{"$f":"IF(VLOOKUP(A325,atualização!A$7:C$114,2,0)=0,\"\",(VLOOKUP(A325,atualização!A$7:C$114,2,0)))","v":""},{"$f":"IF(VLOOKUP(A325,atualização!A$7:C$114,3,0)=0,\"\",(VLOOKUP(A325,atualização!A$7:C$114,3,0)))","v":""},"IPCA≤SELIC / SELIC-IPCA",0,0,1.5449126942775249,3.2703443750356835]
["2026-11-01",{"$f":"IF(VLOOKUP(A326,atualização!A$7:C$114,2,0)=0,\"\",(VLOOKUP(A326,atualização!A$7:C$114,2,0)))","v":""},{"$f":"IF(VLOOKUP(A326,atualização!A$7:C$114,3,0)=0,\"\",(VLOOKUP(A326,atualização!A$7:C$114,3,0)))","v":""},"IPCA≤SELIC / SELIC-IPCA",0,0,{"$f":"G325*(1+E326)","v":1.5449126942775249},3.2703443750356835]
["2026-12-01",{"$f":"IF(VLOOKUP(A327,atualização!A$7:C$114,2,0)=0,\"\",(VLOOKUP(A327,atualização!A$7:C$114,2,0)))","v":""},{"$f":"IF(VLOOKUP(A327,atualização!A$7:C$114,3,0)=0,\"\",(VLOOKUP(A327,atualização!A$7:C$114,3,0)))","v":""},"IPCA≤SELIC / SELIC-IPCA",0,0,1.5449126942775249,3.2703443750356835]
["2027-01-01",{"$f":"IF(VLOOKUP(A328,atualização!A$7:C$114,2,0)=0,\"\",(VLOOKUP(A328,atualização!A$7:C$114,2,0)))","v":""},{"$f":"IF(VLOOKUP(A328,atualização!A$7:C$114,3,0)=0,\"\",(VLOOKUP(A328,atualização!A$7:C$114,3,0)))","v":""},"IPCA≤SELIC / SELIC-IPCA",0,0,1.5449126942775249,3.2703443750356835]
["2027-02-01",{"$f":"IF(VLOOKUP(A329,atualização!A$7:C$114,2,0)=0,\"\",(VLOOKUP(A329,atualização!A$7:C$114,2,0)))","v":""},{"$f":"IF(VLOOKUP(A329,atualização!A$7:C$114,3,0)=0,\"\",(VLOOKUP(A329,atualização!A$7:C$114,3,0)))","v":""},"IPCA≤SELIC / SELIC-IPCA",0,0,1.5449126942775249,3.2703443750356835]
["2027-03-01",{"$f":"IF(VLOOKUP(A330,atualização!A$7:C$114,2,0)=0,\"\",(VLOOKUP(A330,atualização!A$7:C$114,2,0)))","v":""},{"$f":"IF(VLOOKUP(A330,atualização!A$7:C$114,3,0)=0,\"\",(VLOOKUP(A330,atualização!A$7:C$114,3,0)))","v":""},"IPCA≤SELIC / SELIC-IPCA",0,0,1.5449126942775249,3.2703443750356835]
["2027-04-01",{"$f":"IF(VLOOKUP(A331,atualização!A$7:C$114,2,0)=0,\"\",(VLOOKUP(A331,atualização!A$7:C$114,2,0)))","v":""},{"$f":"IF(VLOOKUP(A331,atualização!A$7:C$114,3,0)=0,\"\",(VLOOKUP(A331,atualização!A$7:C$114,3,0)))","v":""},"IPCA≤SELIC / SELIC-IPCA",0,0,1.5449126942775249,3.2703443750356835]
["2027-05-01",{"$f":"IF(VLOOKUP(A332,atualização!A$7:C$114,2,0)=0,\"\",(VLOOKUP(A332,atualização!A$7:C$114,2,0)))","v":""},{"$f":"IF(VLOOKUP(A332,atualização!A$7:C$114,3,0)=0,\"\",(VLOOKUP(A332,atualização!A$7:C$114,3,0)))","v":""},"IPCA≤SELIC / SELIC-IPCA",0,0,1.5449126942775249,3.2703443750356835]
["2027-06-01",{"$f":"IF(VLOOKUP(A333,atualização!A$7:C$114,2,0)=0,\"\",(VLOOKUP(A333,atualização!A$7:C$114,2,0)))","v":""},{"$f":"IF(VLOOKUP(A333,atualização!A$7:C$114,3,0)=0,\"\",(VLOOKUP(A333,atualização!A$7:C$114,3,0)))","v":""},"IPCA≤SELIC / SELIC-IPCA",0,0,1.5449126942775249,3.2703443750356835]
["2027-07-01",{"$f":"IF(VLOOKUP(A334,atualização!A$7:C$114,2,0)=0,\"\",(VLOOKUP(A334,atualização!A$7:C$114,2,0)))","v":""},{"$f":"IF(VLOOKUP(A334,atualização!A$7:C$114,3,0)=0,\"\",(VLOOKUP(A334,atualização!A$7:C$114,3,0)))","v":""},"IPCA≤SELIC / SELIC-IPCA",0,0,1.5449126942775249,3.2703443750356835]
["2027-08-01",{"$f":"IF(VLOOKUP(A335,atualização!A$7:C$114,2,0)=0,\"\",(VLOOKUP(A335,atualização!A$7:C$114,2,0)))","v":""},{"$f":"IF(VLOOKUP(A335,atualização!A$7:C$114,3,0)=0,\"\",(VLOOKUP(A335,atualização!A$7:C$114,3,0)))","v":""},"IPCA≤SELIC / SELIC-IPCA",0,0,1.5449126942775249,3.2703443750356835]
["2027-09-01",{"$f":"IF(VLOOKUP(A336,atualização!A$7:C$114,2,0)=0,\"\",(VLOOKUP(A336,atualização!A$7:C$114,2,0)))","v":""},{"$f":"IF(VLOOKUP(A336,atualização!A$7:C$114,3,0)=0,\"\",(VLOOKUP(A336,atualização!A$7:C$114,3,0)))","v":""},"IPCA≤SELIC / SELIC-IPCA",0,0,1.5449126942775249,3.2703443750356835]
["2027-10-01",{"$f":"IF(VLOOKUP(A337,atualização!A$7:C$114,2,0)=0,\"\",(VLOOKUP(A337,atualização!A$7:C$114,2,0)))","v":""},{"$f":"IF(VLOOKUP(A337,atualização!A$7:C$114,3,0)=0,\"\",(VLOOKUP(A337,atualização!A$7:C$114,3,0)))","v":""},"IPCA≤SELIC / SELIC-IPCA",0,0,1.5449126942775249,3.2703443750356835]
["2027-11-01",{"$f":"IF(VLOOKUP(A338,atualização!A$7:C$114,2,0)=0,\"\",(VLOOKUP(A338,atualização!A$7:C$114,2,0)))","v":""},{"$f":"IF(VLOOKUP(A338,atualização!A$7:C$114,3,0)=0,\"\",(VLOOKUP(A338,atualização!A$7:C$114,3,0)))","v":""},"IPCA≤SELIC / SELIC-IPCA",0,0,1.5449126942775249,3.2703443750356835]
["2027-12-01",{"$f":"IF(VLOOKUP(A339,atualização!A$7:C$114,2,0)=0,\"\",(VLOOKUP(A339,atualização!A$7:C$114,2,0)))","v":""},{"$f":"IF(VLOOKUP(A339,atualização!A$7:C$114,3,0)=0,\"\",(VLOOKUP(A339,atualização!A$7:C$114,3,0)))","v":""},"IPCA≤SELIC / SELIC-IPCA",0,0,1.5449126942775249,3.2703443750356835]
["2028-01-01",{"$f":"IF(VLOOKUP(A340,atualização!A$7:C$114,2,0)=0,\"\",(VLOOKUP(A340,atualização!A$7:C$114,2,0)))","v":""},{"$f":"IF(VLOOKUP(A340,atualização!A$7:C$114,3,0)=0,\"\",(VLOOKUP(A340,atualização!A$7:C$114,3,0)))","v":""},"IPCA≤SELIC / SELIC-IPCA",0,0,1.5449126942775249,3.2703443750356835]
["2028-02-01",{"$f":"IF(VLOOKUP(A341,atualização!A$7:C$114,2,0)=0,\"\",(VLOOKUP(A341,atualização!A$7:C$114,2,0)))","v":""},{"$f":"IF(VLOOKUP(A341,atualização!A$7:C$114,3,0)=0,\"\",(VLOOKUP(A341,atualização!A$7:C$114,3,0)))","v":""},"IPCA≤SELIC / SELIC-IPCA",0,0,1.5449126942775249,3.2703443750356835]
["2028-03-01",{"$f":"IF(VLOOKUP(A342,atualização!A$7:C$114,2,0)=0,\"\",(VLOOKUP(A342,atualização!A$7:C$114,2,0)))","v":""},{"$f":"IF(VLOOKUP(A342,atualização!A$7:C$114,3,0)=0,\"\",(VLOOKUP(A342,atualização!A$7:C$114,3,0)))","v":""},"IPCA≤SELIC / SELIC-IPCA",0,0,1.5449126942775249,3.2703443750356835]
["2028-04-01",{"$f":"IF(VLOOKUP(A343,atualização!A$7:C$114,2,0)=0,\"\",(VLOOKUP(A343,atualização!A$7:C$114,2,0)))","v":""},{"$f":"IF(VLOOKUP(A343,atualização!A$7:C$114,3,0)=0,\"\",(VLOOKUP(A343,atualização!A$7:C$114,3,0)))","v":""},"IPCA≤SELIC / SELIC-IPCA",0,0,1.5449126942775249,3.2703443750356835]
["2028-05-01",{"$f":"IF(VLOOKUP(A344,atualização!A$7:C$114,2,0)=0,\"\",(VLOOKUP(A344,atualização!A$7:C$114,2,0)))","v":""},{"$f":"IF(VLOOKUP(A344,atualização!A$7:C$114,3,0)=0,\"\",(VLOOKUP(A344,atualização!A$7:C$114,3,0)))","v":""},"IPCA≤SELIC / SELIC-IPCA",0,0,1.5449126942775249,3.2703443750356835]
["2028-06-01",{"$f":"IF(VLOOKUP(A345,atualização!A$7:C$114,2,0)=0,\"\",(VLOOKUP(A345,atualização!A$7:C$114,2,0)))","v":""},{"$f":"IF(VLOOKUP(A345,atualização!A$7:C$114,3,0)=0,\"\",(VLOOKUP(A345,atualização!A$7:C$114,3,0)))","v":""},"IPCA≤SELIC / SELIC-IPCA",0,0,1.5449126942775249,3.2703443750356835]
["2028-07-01",{"$f":"IF(VLOOKUP(A346,atualização!A$7:C$114,2,0)=0,\"\",(VLOOKUP(A346,atualização!A$7:C$114,2,0)))","v":""},{"$f":"IF(VLOOKUP(A346,atualização!A$7:C$114,3,0)=0,\"\",(VLOOKUP(A346,atualização!A$7:C$114,3,0)))","v":""},"IPCA≤SELIC / SELIC-IPCA",0,0,1.5449126942775249,3.2703443750356835]
["2028-08-01",{"$f":"IF(VLOOKUP(A347,atualização!A$7:C$114,2,0)=0,\"\",(VLOOKUP(A347,atualização!A$7:C$114,2,0)))","v":""},{"$f":"IF(VLOOKUP(A347,atualização!A$7:C$114,3,0)=0,\"\",(VLOOKUP(A347,atualização!A$7:C$114,3,0)))","v":""},"IPCA≤SELIC / SELIC-IPCA",0,0,1.5449126942775249,3.2703443750356835]
["2028-09-01",{"$f":"IF(VLOOKUP(A348,atualização!A$7:C$114,2,0)=0,\"\",(VLOOKUP(A348,atualização!A$7:C$114,2,0)))","v":""},{"$f":"IF(VLOOKUP(A348,atualização!A$7:C$114,3,0)=0,\"\",(VLOOKUP(A348,atualização!A$7:C$114,3,0)))","v":""},"IPCA≤SELIC / SELIC-IPCA",0,0,1.5449126942775249,3.2703443750356835]
["2028-10-01",{"$f":"IF(VLOOKUP(A349,atualização!A$7:C$114,2,0)=0,\"\",(VLOOKUP(A349,atualização!A$7:C$114,2,0)))","v":""},{"$f":"IF(VLOOKUP(A349,atualização!A$7:C$114,3,0)=0,\"\",(VLOOKUP(A349,atualização!A$7:C$114,3,0)))","v":""},"IPCA≤SELIC / SELIC-IPCA",0,0,1.5449126942775249,3.2703443750356835]
["2028-11-01",{"$f":"IF(VLOOKUP(A350,atualização!A$7:C$114,2,0)=0,\"\",(VLOOKUP(A350,atualização!A$7:C$114,2,0)))","v":""},{"$f":"IF(VLOOKUP(A350,atualização!A$7:C$114,3,0)=0,\"\",(VLOOKUP(A350,atualização!A$7:C$114,3,0)))","v":""},"IPCA≤SELIC / SELIC-IPCA",0,0,1.5449126942775249,3.2703443750356835]
["2028-12-01",{"$f":"IF(VLOOKUP(A351,atualização!A$7:C$114,2,0)=0,\"\",(VLOOKUP(A351,atualização!A$7:C$114,2,0)))","v":""},{"$f":"IF(VLOOKUP(A351,atualização!A$7:C$114,3,0)=0,\"\",(VLOOKUP(A351,atualização!A$7:C$114,3,0)))","v":""},"IPCA≤SELIC / SELIC-IPCA",0,0,1.5449126942775249,{"$f":"IFERROR(H350+(1+H350)*F351,G350)","v":3.2703443750356835}]
["2029-01-01",{"$f":"IF(VLOOKUP(A352,atualização!A$7:C$114,2,0)=0,\"\",(VLOOKUP(A352,atualização!A$7:C$114,2,0)))","v":""},{"$f":"IF(VLOOKUP(A352,atualização!A$7:C$114,3,0)=0,\"\",(VLOOKUP(A352,atualização!A$7:C$114,3,0)))","v":""},"IPCA≤SELIC / SELIC-IPCA",0,0,1.5449126942775249,3.2703443750356835]
["2029-02-01",{"$f":"IF(VLOOKUP(A353,atualização!A$7:C$114,2,0)=0,\"\",(VLOOKUP(A353,atualização!A$7:C$114,2,0)))","v":""},{"$f":"IF(VLOOKUP(A353,atualização!A$7:C$114,3,0)=0,\"\",(VLOOKUP(A353,atualização!A$7:C$114,3,0)))","v":""},"IPCA≤SELIC / SELIC-IPCA",0,0,1.5449126942775249,3.2703443750356835]
["2029-03-01",{"$f":"IF(VLOOKUP(A354,atualização!A$7:C$114,2,0)=0,\"\",(VLOOKUP(A354,atualização!A$7:C$114,2,0)))","v":""},{"$f":"IF(VLOOKUP(A354,atualização!A$7:C$114,3,0)=0,\"\",(VLOOKUP(A354,atualização!A$7:C$114,3,0)))","v":""},"IPCA≤SELIC / SELIC-IPCA",0,0,1.5449126942775249,3.2703443750356835]
["2029-04-01",{"$f":"IF(VLOOKUP(A355,atualização!A$7:C$114,2,0)=0,\"\",(VLOOKUP(A355,atualização!A$7:C$114,2,0)))","v":""},{"$f":"IF(VLOOKUP(A355,atualização!A$7:C$114,3,0)=0,\"\",(VLOOKUP(A355,atualização!A$7:C$114,3,0)))","v":""},"IPCA≤SELIC / SELIC-IPCA",0,{"$f":"IFERROR(MAX(B354-C353,0),0)","v":0},1.5449126942775249,3.2703443750356835]
["2029-05-01",{"$f":"IF(VLOOKUP(A356,atualização!A$7:C$114,2,0)=0,\"\",(VLOOKUP(A356,atualização!A$7:C$114,2,0)))","v":""},{"$f":"IF(VLOOKUP(A356,atualização!A$7:C$114,3,0)=0,\"\",(VLOOKUP(A356,atualização!A$7:C$114,3,0)))","v":""},"IPCA≤SELIC / SELIC-IPCA",0,0,1.5449126942775249,3.2703443750356835]
["2029-06-01",{"$f":"IF(VLOOKUP(A357,atualização!A$7:C$114,2,0)=0,\"\",(VLOOKUP(A357,atualização!A$7:C$114,2,0)))","v":""},{"$f":"IF(VLOOKUP(A357,atualização!A$7:C$114,3,0)=0,\"\",(VLOOKUP(A357,atualização!A$7:C$114,3,0)))","v":""},"IPCA≤SELIC / SELIC-IPCA",0,0,1.5449126942775249,3.2703443750356835]
["2029-07-01",{"$f":"IF(VLOOKUP(A358,atualização!A$7:C$114,2,0)=0,\"\",(VLOOKUP(A358,atualização!A$7:C$114,2,0)))","v":""},{"$f":"IF(VLOOKUP(A358,atualização!A$7:C$114,3,0)=0,\"\",(VLOOKUP(A358,atualização!A$7:C$114,3,0)))","v":""},"IPCA≤SELIC / SELIC-IPCA",0,0,1.5449126942775249,3.2703443750356835]
["2029-08-01",{"$f":"IF(VLOOKUP(A359,atualização!A$7:C$114,2,0)=0,\"\",(VLOOKUP(A359,atualização!A$7:C$114,2,0)))","v":""},{"$f":"IF(VLOOKUP(A359,atualização!A$7:C$114,3,0)=0,\"\",(VLOOKUP(A359,atualização!A$7:C$114,3,0)))","v":""},"IPCA≤SELIC / SELIC-IPCA",0,0,1.5449126942775249,3.2703443750356835]
["2029-09-01",{"$f":"IF(VLOOKUP(A360,atualização!A$7:C$114,2,0)=0,\"\",(VLOOKUP(A360,atualização!A$7:C$114,2,0)))","v":""},{"$f":"IF(VLOOKUP(A360,atualização!A$7:C$114,3,0)=0,\"\",(VLOOKUP(A360,atualização!A$7:C$114,3,0)))","v":""},"IPCA≤SELIC / SELIC-IPCA",0,0,1.5449126942775249,3.2703443750356835]
["2029-10-01",{"$f":"IF(VLOOKUP(A361,atualização!A$7:C$114,2,0)=0,\"\",(VLOOKUP(A361,atualização!A$7:C$114,2,0)))","v":""},{"$f":"IF(VLOOKUP(A361,atualização!A$7:C$114,3,0)=0,\"\",(VLOOKUP(A361,atualização!A$7:C$114,3,0)))","v":""},"IPCA≤SELIC / SELIC-IPCA",0,0,1.5449126942775249,3.2703443750356835]
["2029-11-01",{"$f":"IF(VLOOKUP(A362,atualização!A$7:C$114,2,0)=0,\"\",(VLOOKUP(A362,atualização!A$7:C$114,2,0)))","v":""},{"$f":"IF(VLOOKUP(A362,atualização!A$7:C$114,3,0)=0,\"\",(VLOOKUP(A362,atualização!A$7:C$114,3,0)))","v":""},"IPCA≤SELIC / SELIC-IPCA",0,0,1.5449126942775249,3.2703443750356835]
["2029-12-01",{"$f":"IF(VLOOKUP(A363,atualização!A$7:C$114,2,0)=0,\"\",(VLOOKUP(A363,atualização!A$7:C$114,2,0)))","v":""},{"$f":"IF(VLOOKUP(A363,atualização!A$7:C$114,3,0)=0,\"\",(VLOOKUP(A363,atualização!A$7:C$114,3,0)))","v":""},"IPCA≤SELIC / SELIC-IPCA",0,0,1.5449126942775249,3.2703443750356835]
["2030-01-01",{"$f":"IF(VLOOKUP(A364,atualização!A$7:C$114,2,0)=0,\"\",(VLOOKUP(A364,atualização!A$7:C$114,2,0)))","v":""},{"$f":"IF(VLOOKUP(A364,atualização!A$7:C$114,3,0)=0,\"\",(VLOOKUP(A364,atualização!A$7:C$114,3,0)))","v":""},"IPCA≤SELIC / SELIC-IPCA",0,0,1.5449126942775249,3.2703443750356835]
["2030-02-01",{"$f":"IF(VLOOKUP(A365,atualização!A$7:C$114,2,0)=0,\"\",(VLOOKUP(A365,atualização!A$7:C$114,2,0)))","v":""},{"$f":"IF(VLOOKUP(A365,atualização!A$7:C$114,3,0)=0,\"\",(VLOOKUP(A365,atualização!A$7:C$114,3,0)))","v":""},"IPCA≤SELIC / SELIC-IPCA",0,0,1.5449126942775249,3.2703443750356835]
["2030-03-01",{"$f":"IF(VLOOKUP(A366,atualização!A$7:C$114,2,0)=0,\"\",(VLOOKUP(A366,atualização!A$7:C$114,2,0)))","v":""},{"$f":"IF(VLOOKUP(A366,atualização!A$7:C$114,3,0)=0,\"\",(VLOOKUP(A366,atualização!A$7:C$114,3,0)))","v":""},"IPCA≤SELIC / SELIC-IPCA",0,0,1.5449126942775249,3.2703443750356835]
["2030-04-01",{"$f":"IF(VLOOKUP(A367,atualização!A$7:C$114,2,0)=0,\"\",(VLOOKUP(A367,atualização!A$7:C$114,2,0)))","v":""},{"$f":"IF(VLOOKUP(A367,atualização!A$7:C$114,3,0)=0,\"\",(VLOOKUP(A367,atualização!A$7:C$114,3,0)))","v":""},"IPCA≤SELIC / SELIC-IPCA",0,0,1.5449126942775249,3.2703443750356835]
["2030-05-01",{"$f":"IF(VLOOKUP(A368,atualização!A$7:C$114,2,0)=0,\"\",(VLOOKUP(A368,atualização!A$7:C$114,2,0)))","v":""},{"$f":"IF(VLOOKUP(A368,atualização!A$7:C$114,3,0)=0,\"\",(VLOOKUP(A368,atualização!A$7:C$114,3,0)))","v":""},"IPCA≤SELIC / SELIC-IPCA",0,0,1.5449126942775249,3.2703443750356835]
["2030-06-01",{"$f":"IF(VLOOKUP(A369,atualização!A$7:C$114,2,0)=0,\"\",(VLOOKUP(A369,atualização!A$7:C$114,2,0)))","v":""},{"$f":"IF(VLOOKUP(A369,atualização!A$7:C$114,3,0)=0,\"\",(VLOOKUP(A369,atualização!A$7:C$114,3,0)))","v":""},"IPCA≤SELIC / SELIC-IPCA",{"$f":"IFERROR(MIN(B368,C367),0)","v":0},0,1.5449126942775249,3.2703443750356835]
["2030-07-01",{"$f":"IF(VLOOKUP(A370,atualização!A$7:C$114,2,0)=0,\"\",(VLOOKUP(A370,atualização!A$7:C$114,2,0)))","v":""},{"$f":"IF(VLOOKUP(A370,atualização!A$7:C$114,3,0)=0,\"\",(VLOOKUP(A370,atualização!A$7:C$114,3,0)))","v":""},"IPCA≤SELIC / SELIC-IPCA",0,0,1.5449126942775249,3.2703443750356835]
["2030-08-01",{"$f":"IF(VLOOKUP(A371,atualização!A$7:C$114,2,0)=0,\"\",(VLOOKUP(A371,atualização!A$7:C$114,2,0)))","v":""},{"$f":"IF(VLOOKUP(A371,atualização!A$7:C$114,3,0)=0,\"\",(VLOOKUP(A371,atualização!A$7:C$114,3,0)))","v":""},"IPCA≤SELIC / SELIC-IPCA",0,0,1.5449126942775249,3.2703443750356835]
["2030-09-01",{"$f":"IF(VLOOKUP(A372,atualização!A$7:C$114,2,0)=0,\"\",(VLOOKUP(A372,atualização!A$7:C$114,2,0)))","v":""},{"$f":"IF(VLOOKUP(A372,atualização!A$7:C$114,3,0)=0,\"\",(VLOOKUP(A372,atualização!A$7:C$114,3,0)))","v":""},"IPCA≤SELIC / SELIC-IPCA",0,0,1.5449126942775249,3.2703443750356835]
["2030-10-01",{"$f":"IF(VLOOKUP(A373,atualização!A$7:C$114,2,0)=0,\"\",(VLOOKUP(A373,atualização!A$7:C$114,2,0)))","v":""},{"$f":"IF(VLOOKUP(A373,atualização!A$7:C$114,3,0)=0,\"\",(VLOOKUP(A373,atualização!A$7:C$114,3,0)))","v":""},"IPCA≤SELIC / SELIC-IPCA",0,0,1.5449126942775249,3.2703443750356835]
["2030-11-01",{"$f":"IF(VLOOKUP(A374,atualização!A$7:C$114,2,0)=0,\"\",(VLOOKUP(A374,atualização!A$7:C$114,2,0)))","v":""},{"$f":"IF(VLOOKUP(A374,atualização!A$7:C$114,3,0)=0,\"\",(VLOOKUP(A374,atualização!A$7:C$114,3,0)))","v":""},"IPCA≤SELIC / SELIC-IPCA",0,0,1.5449126942775249,3.2703443750356835]
["2030-12-01",{"$f":"IF(VLOOKUP(A375,atualização!A$7:C$114,2,0)=0,\"\",(VLOOKUP(A375,atualização!A$7:C$114,2,0)))","v":""},{"$f":"IF(VLOOKUP(A375,atualização!A$7:C$114,3,0)=0,\"\",(VLOOKUP(A375,atualização!A$7:C$114,3,0)))","v":""},"IPCA≤SELIC / SELIC-IPCA",0,0,1.5449126942775249,3.2703443750356835]
["2031-01-01",{"$f":"IF(VLOOKUP(A376,atualização!A$7:C$114,2,0)=0,\"\",(VLOOKUP(A376,atualização!A$7:C$114,2,0)))","v":""},{"$f":"IF(VLOOKUP(A376,atualização!A$7:C$114,3,0)=0,\"\",(VLOOKUP(A376,atualização!A$7:C$114,3,0)))","v":""},"IPCA≤SELIC / SELIC-IPCA",0,0,1.5449126942775249,3.2703443750356835]
["2031-02-01",{"$f":"IF(VLOOKUP(A377,atualização!A$7:C$114,2,0)=0,\"\",(VLOOKUP(A377,atualização!A$7:C$114,2,0)))","v":""},{"$f":"IF(VLOOKUP(A377,atualização!A$7:C$114,3,0)=0,\"\",(VLOOKUP(A377,atualização!A$7:C$114,3,0)))","v":""},"IPCA≤SELIC / SELIC-IPCA",0,0,1.5449126942775249,3.2703443750356835]
["2031-03-01",{"$f":"IF(VLOOKUP(A378,atualização!A$7:C$114,2,0)=0,\"\",(VLOOKUP(A378,atualização!A$7:C$114,2,0)))","v":""},{"$f":"IF(VLOOKUP(A378,atualização!A$7:C$114,3,0)=0,\"\",(VLOOKUP(A378,atualização!A$7:C$114,3,0)))","v":""},"IPCA≤SELIC / SELIC-IPCA",0,0,1.5449126942775249,3.2703443750356835]
["2031-04-01",{"$f":"IF(VLOOKUP(A379,atualização!A$7:C$114,2,0)=0,\"\",(VLOOKUP(A379,atualização!A$7:C$114,2,0)))","v":""},{"$f":"IF(VLOOKUP(A379,atualização!A$7:C$114,3,0)=0,\"\",(VLOOKUP(A379,atualização!A$7:C$114,3,0)))","v":""},"IPCA≤SELIC / SELIC-IPCA",0,0,1.5449126942775249,3.2703443750356835]
["2031-05-01",{"$f":"IF(VLOOKUP(A380,atualização!A$7:C$114,2,0)=0,\"\",(VLOOKUP(A380,atualização!A$7:C$114,2,0)))","v":""},{"$f":"IF(VLOOKUP(A380,atualização!A$7:C$114,3,0)=0,\"\",(VLOOKUP(A380,atualização!A$7:C$114,3,0)))","v":""},"IPCA≤SELIC / SELIC-IPCA",0,0,1.5449126942775249,3.2703443750356835]
["2031-06-01",{"$f":"IF(VLOOKUP(A381,atualização!A$7:C$114,2,0)=0,\"\",(VLOOKUP(A381,atualização!A$7:C$114,2,0)))","v":""},{"$f":"IF(VLOOKUP(A381,atualização!A$7:C$114,3,0)=0,\"\",(VLOOKUP(A381,atualização!A$7:C$114,3,0)))","v":""},"IPCA≤SELIC / SELIC-IPCA",0,0,1.5449126942775249,3.2703443750356835]
["2031-07-01",{"$f":"IF(VLOOKUP(A382,atualização!A$7:C$114,2,0)=0,\"\",(VLOOKUP(A382,atualização!A$7:C$114,2,0)))","v":""},{"$f":"IF(VLOOKUP(A382,atualização!A$7:C$114,3,0)=0,\"\",(VLOOKUP(A382,atualização!A$7:C$114,3,0)))","v":""},"IPCA≤SELIC / SELIC-IPCA",0,0,1.5449126942775249,3.2703443750356835]
["2031-08-01",{"$f":"IF(VLOOKUP(A383,atualização!A$7:C$114,2,0)=0,\"\",(VLOOKUP(A383,atualização!A$7:C$114,2,0)))","v":""},{"$f":"IF(VLOOKUP(A383,atualização!A$7:C$114,3,0)=0,\"\",(VLOOKUP(A383,atualização!A$7:C$114,3,0)))","v":""},"IPCA≤SELIC / SELIC-IPCA",0,0,1.5449126942775249,{"$f":"IFERROR(H382+(1+H382)*F383,G382)","v":3.2703443750356835}]
["2031-09-01",{"$f":"IF(VLOOKUP(A384,atualização!A$7:C$114,2,0)=0,\"\",(VLOOKUP(A384,atualização!A$7:C$114,2,0)))","v":""},{"$f":"IF(VLOOKUP(A384,atualização!A$7:C$114,3,0)=0,\"\",(VLOOKUP(A384,atualização!A$7:C$114,3,0)))","v":""},"IPCA≤SELIC / SELIC-IPCA",0,0,1.5449126942775249,3.2703443750356835]
["2031-10-01",{"$f":"IF(VLOOKUP(A385,atualização!A$7:C$114,2,0)=0,\"\",(VLOOKUP(A385,atualização!A$7:C$114,2,0)))","v":""},{"$f":"IF(VLOOKUP(A385,atualização!A$7:C$114,3,0)=0,\"\",(VLOOKUP(A385,atualização!A$7:C$114,3,0)))","v":""},"IPCA≤SELIC / SELIC-IPCA",0,0,1.5449126942775249,3.2703443750356835]
["2031-11-01",{"$f":"IF(VLOOKUP(A386,atualização!A$7:C$114,2,0)=0,\"\",(VLOOKUP(A386,atualização!A$7:C$114,2,0)))","v":""},{"$f":"IF(VLOOKUP(A386,atualização!A$7:C$114,3,0)=0,\"\",(VLOOKUP(A386,atualização!A$7:C$114,3,0)))","v":""},"IPCA≤SELIC / SELIC-IPCA",0,0,1.5449126942775249,3.2703443750356835]
["2031-12-01",{"$f":"IF(VLOOKUP(A387,atualização!A$7:C$114,2,0)=0,\"\",(VLOOKUP(A387,atualização!A$7:C$114,2,0)))","v":""},{"$f":"IF(VLOOKUP(A387,atualização!A$7:C$114,3,0)=0,\"\",(VLOOKUP(A387,atualização!A$7:C$114,3,0)))","v":""},"IPCA≤SELIC / SELIC-IPCA",0,0,1.5449126942775249,3.2703443750356835]
["2032-01-01",{"$f":"IF(VLOOKUP(A388,atualização!A$7:C$114,2,0)=0,\"\",(VLOOKUP(A388,atualização!A$7:C$114,2,0)))","v":""},{"$f":"IF(VLOOKUP(A388,atualização!A$7:C$114,3,0)=0,\"\",(VLOOKUP(A388,atualização!A$7:C$114,3,0)))","v":""},"IPCA≤SELIC / SELIC-IPCA",0,0,1.5449126942775249,3.2703443750356835]
["2032-02-01",{"$f":"IF(VLOOKUP(A389,atualização!A$7:C$114,2,0)=0,\"\",(VLOOKUP(A389,atualização!A$7:C$114,2,0)))","v":""},{"$f":"IF(VLOOKUP(A389,atualização!A$7:C$114,3,0)=0,\"\",(VLOOKUP(A389,atualização!A$7:C$114,3,0)))","v":""},"IPCA≤SELIC / SELIC-IPCA",0,0,1.5449126942775249,3.2703443750356835]
["2032-03-01",{"$f":"IF(VLOOKUP(A390,atualização!A$7:C$114,2,0)=0,\"\",(VLOOKUP(A390,atualização!A$7:C$114,2,0)))","v":""},{"$f":"IF(VLOOKUP(A390,atualização!A$7:C$114,3,0)=0,\"\",(VLOOKUP(A390,atualização!A$7:C$114,3,0)))","v":""},"IPCA≤SELIC / SELIC-IPCA",0,0,{"$f":"G389*(1+E390)","v":1.5449126942775249},3.2703443750356835]
["2032-04-01",{"$f":"IF(VLOOKUP(A391,atualização!A$7:C$114,2,0)=0,\"\",(VLOOKUP(A391,atualização!A$7:C$114,2,0)))","v":""},{"$f":"IF(VLOOKUP(A391,atualização!A$7:C$114,3,0)=0,\"\",(VLOOKUP(A391,atualização!A$7:C$114,3,0)))","v":""},"IPCA≤SELIC / SELIC-IPCA",0,0,1.5449126942775249,3.2703443750356835]
["2032-05-01",{"$f":"IF(VLOOKUP(A392,atualização!A$7:C$114,2,0)=0,\"\",(VLOOKUP(A392,atualização!A$7:C$114,2,0)))","v":""},{"$f":"IF(VLOOKUP(A392,atualização!A$7:C$114,3,0)=0,\"\",(VLOOKUP(A392,atualização!A$7:C$114,3,0)))","v":""},"IPCA≤SELIC / SELIC-IPCA",0,0,1.5449126942775249,3.2703443750356835]
["2032-06-01",{"$f":"IF(VLOOKUP(A393,atualização!A$7:C$114,2,0)=0,\"\",(VLOOKUP(A393,atualização!A$7:C$114,2,0)))","v":""},{"$f":"IF(VLOOKUP(A393,atualização!A$7:C$114,3,0)=0,\"\",(VLOOKUP(A393,atualização!A$7:C$114,3,0)))","v":""},"IPCA≤SELIC / SELIC-IPCA",0,0,1.5449126942775249,3.2703443750356835]
["2032-07-01",{"$f":"IF(VLOOKUP(A394,atualização!A$7:C$114,2,0)=0,\"\",(VLOOKUP(A394,atualização!A$7:C$114,2,0)))","v":""},{"$f":"IF(VLOOKUP(A394,atualização!A$7:C$114,3,0)=0,\"\",(VLOOKUP(A394,atualização!A$7:C$114,3,0)))","v":""},"IPCA≤SELIC / SELIC-IPCA",0,0,1.5449126942775249,3.2703443750356835]
["2032-08-01",{"$f":"IF(VLOOKUP(A395,atualização!A$7:C$114,2,0)=0,\"\",(VLOOKUP(A395,atualização!A$7:C$114,2,0)))","v":""},{"$f":"IF(VLOOKUP(A395,atualização!A$7:C$114,3,0)=0,\"\",(VLOOKUP(A395,atualização!A$7:C$114,3,0)))","v":""},"IPCA≤SELIC / SELIC-IPCA",0,0,1.5449126942775249,3.2703443750356835]
["2032-09-01",{"$f":"IF(VLOOKUP(A396,atualização!A$7:C$114,2,0)=0,\"\",(VLOOKUP(A396,atualização!A$7:C$114,2,0)))","v":""},{"$f":"IF(VLOOKUP(A396,atualização!A$7:C$114,3,0)=0,\"\",(VLOOKUP(A396,atualização!A$7:C$114,3,0)))","v":""},"IPCA≤SELIC / SELIC-IPCA",0,0,1.5449126942775249,3.2703443750356835]
["2032-10-01",{"$f":"IF(VLOOKUP(A397,atualização!A$7:C$114,2,0)=0,\"\",(VLOOKUP(A397,atualização!A$7:C$114,2,0)))","v":""},{"$f":"IF(VLOOKUP(A397,atualização!A$7:C$114,3,0)=0,\"\",(VLOOKUP(A397,atualização!A$7:C$114,3,0)))","v":""},"IPCA≤SELIC / SELIC-IPCA",0,0,1.5449126942775249,3.2703443750356835]
["2032-11-01",{"$f":"IF(VLOOKUP(A398,atualização!A$7:C$114,2,0)=0,\"\",(VLOOKUP(A398,atualização!A$7:C$114,2,0)))","v":""},{"$f":"IF(VLOOKUP(A398,atualização!A$7:C$114,3,0)=0,\"\",(VLOOKUP(A398,atualização!A$7:C$114,3,0)))","v":""},"IPCA≤SELIC / SELIC-IPCA",0,0,1.5449126942775249,3.2703443750356835]
["2032-12-01",{"$f":"IF(VLOOKUP(A399,atualização!A$7:C$114,2,0)=0,\"\",(VLOOKUP(A399,atualização!A$7:C$114,2,0)))","v":""},{"$f":"IF(VLOOKUP(A399,atualização!A$7:C$114,3,0)=0,\"\",(VLOOKUP(A399,atualização!A$7:C$114,3,0)))","v":""},"IPCA≤SELIC / SELIC-IPCA",0,0,1.5449126942775249,3.2703443750356835]
["2033-01-01",{"$f":"IF(VLOOKUP(A400,atualização!A$7:C$114,2,0)=0,\"\",(VLOOKUP(A400,atualização!A$7:C$114,2,0)))","v":""},{"$f":"IF(VLOOKUP(A400,atualização!A$7:C$114,3,0)=0,\"\",(VLOOKUP(A400,atualização!A$7:C$114,3,0)))","v":""},"IPCA≤SELIC / SELIC-IPCA",0,0,1.5449126942775249,3.2703443750356835]
["2033-02-01",{"$f":"IF(VLOOKUP(A401,atualização!A$7:C$114,2,0)=0,\"\",(VLOOKUP(A401,atualização!A$7:C$114,2,0)))","v":""},{"$f":"IF(VLOOKUP(A401,atualização!A$7:C$114,3,0)=0,\"\",(VLOOKUP(A401,atualização!A$7:C$114,3,0)))","v":""},"IPCA≤SELIC / SELIC-IPCA",0,0,1.5449126942775249,3.2703443750356835]
["2033-03-01",{"$f":"IF(VLOOKUP(A402,atualização!A$7:C$114,2,0)=0,\"\",(VLOOKUP(A402,atualização!A$7:C$114,2,0)))","v":""},{"$f":"IF(VLOOKUP(A402,atualização!A$7:C$114,3,0)=0,\"\",(VLOOKUP(A402,atualização!A$7:C$114,3,0)))","v":""},"IPCA≤SELIC / SELIC-IPCA",0,0,1.5449126942775249,3.2703443750356835]
["2033-04-01",{"$f":"IF(VLOOKUP(A403,atualização!A$7:C$114,2,0)=0,\"\",(VLOOKUP(A403,atualização!A$7:C$114,2,0)))","v":""},{"$f":"IF(VLOOKUP(A403,atualização!A$7:C$114,3,0)=0,\"\",(VLOOKUP(A403,atualização!A$7:C$114,3,0)))","v":""},"IPCA≤SELIC / SELIC-IPCA",0,0,1.5449126942775249,3.2703443750356835]
["2033-05-01",{"$f":"IF(VLOOKUP(A404,atualização!A$7:C$114,2,0)=0,\"\",(VLOOKUP(A404,atualização!A$7:C$114,2,0)))","v":""},{"$f":"IF(VLOOKUP(A404,atualização!A$7:C$114,3,0)=0,\"\",(VLOOKUP(A404,atualização!A$7:C$114,3,0)))","v":""},"IPCA≤SELIC / SELIC-IPCA",0,0,1.5449126942775249,3.2703443750356835]
["2033-06-01",{"$f":"IF(VLOOKUP(A405,atualização!A$7:C$114,2,0)=0,\"\",(VLOOKUP(A405,atualização!A$7:C$114,2,0)))","v":""},{"$f":"IF(VLOOKUP(A405,atualização!A$7:C$114,3,0)=0,\"\",(VLOOKUP(A405,atualização!A$7:C$114,3,0)))","v":""},"IPCA≤SELIC / SELIC-IPCA",0,0,1.5449126942775249,3.2703443750356835]
["2033-07-01",{"$f":"IF(VLOOKUP(A406,atualização!A$7:C$114,2,0)=0,\"\",(VLOOKUP(A406,atualização!A$7:C$114,2,0)))","v":""},{"$f":"IF(VLOOKUP(A406,atualização!A$7:C$114,3,0)=0,\"\",(VLOOKUP(A406,atualização!A$7:C$114,3,0)))","v":""},"IPCA≤SELIC / SELIC-IPCA",0,0,1.5449126942775249,3.2703443750356835]
["2033-08-01",{"$f":"IF(VLOOKUP(A407,atualização!A$7:C$114,2,0)=0,\"\",(VLOOKUP(A407,atualização!A$7:C$114,2,0)))","v":""},{"$f":"IF(VLOOKUP(A407,atualização!A$7:C$114,3,0)=0,\"\",(VLOOKUP(A407,atualização!A$7:C$114,3,0)))","v":""},"IPCA≤SELIC / SELIC-IPCA",0,0,1.5449126942775249,3.2703443750356835]
["2033-09-01",{"$f":"IF(VLOOKUP(A408,atualização!A$7:C$114,2,0)=0,\"\",(VLOOKUP(A408,atualização!A$7:C$114,2,0)))","v":""},{"$f":"IF(VLOOKUP(A408,atualização!A$7:C$114,3,0)=0,\"\",(VLOOKUP(A408,atualização!A$7:C$114,3,0)))","v":""},"IPCA≤SELIC / SELIC-IPCA",0,0,1.5449126942775249,3.2703443750356835]
["2033-10-01",{"$f":"IF(VLOOKUP(A409,atualização!A$7:C$114,2,0)=0,\"\",(VLOOKUP(A409,atualização!A$7:C$114,2,0)))","v":""},{"$f":"IF(VLOOKUP(A409,atualização!A$7:C$114,3,0)=0,\"\",(VLOOKUP(A409,atualização!A$7:C$114,3,0)))","v":""},"IPCA≤SELIC / SELIC-IPCA",0,0,1.5449126942775249,3.2703443750356835]
["2033-11-01",{"$f":"IF(VLOOKUP(A410,atualização!A$7:C$114,2,0)=0,\"\",(VLOOKUP(A410,atualização!A$7:C$114,2,0)))","v":""},{"$f":"IF(VLOOKUP(A410,atualização!A$7:C$114,3,0)=0,\"\",(VLOOKUP(A410,atualização!A$7:C$114,3,0)))","v":""},"IPCA≤SELIC / SELIC-IPCA",0,0,1.5449126942775249,3.2703443750356835]
["2033-12-01",{"$f":"IF(VLOOKUP(A411,atualização!A$7:C$114,2,0)=0,\"\",(VLOOKUP(A411,atualização!A$7:C$114,2,0)))","v":""},{"$f":"IF(VLOOKUP(A411,atualização!A$7:C$114,3,0)=0,\"\",(VLOOKUP(A411,atualização!A$7:C$114,3,0)))","v":""},"IPCA≤SELIC / SELIC-IPCA",0,0,1.5449126942775249,3.2703443750356835]
["2034-01-01",{"$f":"IF(VLOOKUP(A412,atualização!A$7:C$114,2,0)=0,\"\",(VLOOKUP(A412,atualização!A$7:C$114,2,0)))","v":""},{"$f":"IF(VLOOKUP(A412,atualização!A$7:C$114,3,0)=0,\"\",(VLOOKUP(A412,atualização!A$7:C$114,3,0)))","v":""},"IPCA≤SELIC / SELIC-IPCA",0,0,1.5449126942775249,3.2703443750356835]
["2034-02-01",{"$f":"IF(VLOOKUP(A413,atualização!A$7:C$114,2,0)=0,\"\",(VLOOKUP(A413,atualização!A$7:C$114,2,0)))","v":""},{"$f":"IF(VLOOKUP(A413,atualização!A$7:C$114,3,0)=0,\"\",(VLOOKUP(A413,atualização!A$7:C$114,3,0)))","v":""},"IPCA≤SELIC / SELIC-IPCA",0,0,1.5449126942775249,3.2703443750356835]
["2034-03-01",{"$f":"IF(VLOOKUP(A414,atualização!A$7:C$114,2,0)=0,\"\",(VLOOKUP(A414,atualização!A$7:C$114,2,0)))","v":""},{"$f":"IF(VLOOKUP(A414,atualização!A$7:C$114,3,0)=0,\"\",(VLOOKUP(A414,atualização!A$7:C$114,3,0)))","v":""},"IPCA≤SELIC / SELIC-IPCA",0,0,1.5449126942775249,3.2703443750356835]
["2034-04-01",{"$f":"IF(VLOOKUP(A415,atualização!A$7:C$114,2,0)=0,\"\",(VLOOKUP(A415,atualização!A$7:C$114,2,0)))","v":""},{"$f":"IF(VLOOKUP(A415,atualização!A$7:C$114,3,0)=0,\"\",(VLOOKUP(A415,atualização!A$7:C$114,3,0)))","v":""},"IPCA≤SELIC / SELIC-IPCA",0,0,1.5449126942775249,{"$f":"IFERROR(H414+(1+H414)*F415,G414)","v":3.2703443750356835}]
["2034-05-01",{"$f":"IF(VLOOKUP(A416,atualização!A$7:C$114,2,0)=0,\"\",(VLOOKUP(A416,atualização!A$7:C$114,2,0)))","v":""},{"$f":"IF(VLOOKUP(A416,atualização!A$7:C$114,3,0)=0,\"\",(VLOOKUP(A416,atualização!A$7:C$114,3,0)))","v":""},"IPCA≤SELIC / SELIC-IPCA",0,0,1.5449126942775249,3.2703443750356835]
["2034-06-01",{"$f":"IF(VLOOKUP(A417,atualização!A$7:C$114,2,0)=0,\"\",(VLOOKUP(A417,atualização!A$7:C$114,2,0)))","v":""},{"$f":"IF(VLOOKUP(A417,atualização!A$7:C$114,3,0)=0,\"\",(VLOOKUP(A417,atualização!A$7:C$114,3,0)))","v":""},"IPCA≤SELIC / SELIC-IPCA",0,0,1.5449126942775249,3.2703443750356835]
["2034-07-01",{"$f":"IF(VLOOKUP(A418,atualização!A$7:C$114,2,0)=0,\"\",(VLOOKUP(A418,atualização!A$7:C$114,2,0)))","v":""},{"$f":"IF(VLOOKUP(A418,atualização!A$7:C$114,3,0)=0,\"\",(VLOOKUP(A418,atualização!A$7:C$114,3,0)))","v":""},"IPCA≤SELIC / SELIC-IPCA",0,0,1.5449126942775249,3.2703443750356835]
["2034-08-01",{"$f":"IF(VLOOKUP(A419,atualização!A$7:C$114,2,0)=0,\"\",(VLOOKUP(A419,atualização!A$7:C$114,2,0)))","v":""},{"$f":"IF(VLOOKUP(A419,atualização!A$7:C$114,3,0)=0,\"\",(VLOOKUP(A419,atualização!A$7:C$114,3,0)))","v":""},"IPCA≤SELIC / SELIC-IPCA",0,{"$f":"IFERROR(MAX(B418-C417,0),0)","v":0},1.5449126942775249,3.2703443750356835]
["2034-09-01",{"$f":"IF(VLOOKUP(A420,atualização!A$7:C$114,2,0)=0,\"\",(VLOOKUP(A420,atualização!A$7:C$114,2,0)))","v":""},{"$f":"IF(VLOOKUP(A420,atualização!A$7:C$114,3,0)=0,\"\",(VLOOKUP(A420,atualização!A$7:C$114,3,0)))","v":""},"IPCA≤SELIC / SELIC-IPCA",0,0,1.5449126942775249,3.2703443750356835]
["2034-10-01",{"$f":"IF(VLOOKUP(A421,atualização!A$7:C$114,2,0)=0,\"\",(VLOOKUP(A421,atualização!A$7:C$114,2,0)))","v":""},{"$f":"IF(VLOOKUP(A421,atualização!A$7:C$114,3,0)=0,\"\",(VLOOKUP(A421,atualização!A$7:C$114,3,0)))","v":""},"IPCA≤SELIC / SELIC-IPCA",0,0,1.5449126942775249,3.2703443750356835]
["2034-11-01",{"$f":"IF(VLOOKUP(A422,atualização!A$7:C$114,2,0)=0,\"\",(VLOOKUP(A422,atualização!A$7:C$114,2,0)))","v":""},{"$f":"IF(VLOOKUP(A422,atualização!A$7:C$114,3,0)=0,\"\",(VLOOKUP(A422,atualização!A$7:C$114,3,0)))","v":""},"IPCA≤SELIC / SELIC-IPCA",0,0,1.5449126942775249,3.2703443750356835]
["2034-12-01",{"$f":"IF(VLOOKUP(A423,atualização!A$7:C$114,2,0)=0,\"\",(VLOOKUP(A423,atualização!A$7:C$114,2,0)))","v":""},{"$f":"IF(VLOOKUP(A423,atualização!A$7:C$114,3,0)=0,\"\",(VLOOKUP(A423,atualização!A$7:C$114,3,0)))","v":""},"IPCA≤SELIC / SELIC-IPCA",0,0,1.5449126942775249,3.2703443750356835]
[]
[]
[]
[]
["▶  PARA ATUALIZAR: Insira novos meses abaixo desta linha. Preencha as colunas A (data), B (SELIC), C (IPCA). Copie as fórmulas das colunas D-H da linha acima. As colunas D a H são calculadas automaticamente pelas fórmulas já existentes nas linhas acima."]