{"text_format":"1","workbook":"xlsx","n_sheets":4,"sheets":["Orientações","CALCULADORA","atualização","Índices"],"not_rendered":{"charts":0,"images":1,"macros":1,"external_links":0,"defined_names":5,"comments":0,"pivot_tables":0},"unopened":[],"bounds":{"document_bytes":16777216,"sheet_cells":100000,"rows_first":2000,"rows_last":500,"rows_between":2000,"halvings":0,"cell_chars":16384,"cell_head_chars":4096},"cells_cut":0,"cells_raw":0,"read":"whole","date_system":"1900"}

{"sheet":"Orientações","index":0,"n_rows":12,"n_cols":2,"rows_kept":12,"cut":false,"hidden":false,"merged":[]}
[]
[null,"ORIENTAÇÕES DE USO – CALCULADORA DE CRÉDITO NÃO TRIBUTÁRIO"]
[]
[null,"Como usar a calculadora"]
[null,"1. Ao Abrir o arquivo habilite a execução da macro.\n2. Acesse a aba CALCULADORA.\n3. Informe a DATA INICIAL (célula C7): deve ser o mês subsequente ao mês do vencimento do crédito.\n   Exemplo: vencimento em 15/01/2024 → Data Inicial = 02/2024.\n4. Informe a DATA FINAL (célula C8): mês de apuração (data do cálculo).\n5. Informe o VALOR PRINCIPAL (célula C9): valor original do crédito em R$.\n6. Os resultados aparecem automaticamente na seção RESULTADO DO CÁLCULO.\n7. A memória detalhada mês a mês é exibida na tabela abaixo."]
[]
[null,"Entendendo os períodos de cálculo"]
[null,"• 02/2000 a 02/2018 → Taxa SELIC acumulada (correção monetária já inclusa nos juros).\n  O valor nominal do principal e da multa permanece inalterado.\n\n• 03/2018 a 09/2023 → Correção: IPCA do mês anterior (Decreto 45.708/2018).\n  Juros: 1% a.m. fixo sobre o total do débito (Lei 16.226/2017).\n\n• 10/2023 em diante → Correção: IPCA limitado à SELIC.\n  Juros: diferença positiva entre SELIC e IPCA (quando IPCA ≥ SELIC, juros = 0).\n  Base: decisão do STF que vedou índices estaduais superiores aos da União."]
[]
[]
[null,"Base legal e referências"]
[null,"• Lei Estadual nº 10.654/1991, arts. 86 e 90 (atualização monetária e juros de tributos estaduais)\n• Lei Estadual nº 16.226/2017 (retorno aos 1% de juros a partir de 03/2018)\n• Decreto Estadual nº 45.708/2018 (uso do IPCA como índice de correção)\n• Lei Estadual nº 13.178/2006, art. 3º (prazo de 10 dias no TCC para crédito não tributário)\n• Decisão do STF (ADPF/RE) – vedação a índices estaduais superiores aos federais (vigência 10/2023)\n• STJ – EDcl no AgInt no AREsp 948395/RS, DJ 19/08/2019 (irretroatividade de normas de juros)\n• Nota Técnica nº 2/2026 – Diretoria de Sistemas Corporativos Tributários – SEFAZ/PE"]

{"sheet":"CALCULADORA","index":1,"n_rows":501,"n_cols":8,"rows_kept":501,"cut":false,"hidden":false,"merged":[[422,1,422,5],[18,1,18,5],[14,2,14,5],[421,1,421,5],[11,1,11,5],[12,2,12,5],[16,2,16,5],[15,2,15,5],[13,2,13,5],[4,1,4,5],[6,1,6,5],[9,4,9,5],[1,1,1,5],[2,1,2,5],[7,4,7,5],[3,1,3,5],[8,4,8,5]]}
[]
[]
[]
[null,"CALCULADORA DE ATUALIZAÇÃO DE CRÉDITO NÃO TRIBUTÁRIO"]
[null,"Atualização Monetária e Juros Moratórios – Boletim GCI Nº 03/2026"]
[]
[null,"DADOS DE ENTRADA"]
[null,"DATA INICIAL\n(Mês seguinte ao vencimento)","2018-11-01","Devedor"]
[null,"DATA FINAL\n(Data de apuração)","2026-03-01","Origem do Débito","Ex. não aplicação dos recursos da emenda parlamentar nº xxxxxxxx"]
[null,"Valor Principal (R$)",200000,"Responsável pela atualização"]
[]
[null,"RESULTADO DO CÁLCULO"]
[null,"Índice de Correção Aplicado","Período 02/2000–02/2018: SELIC (correção+juros inclusos)\nPeríodo 03/2018–09/2023: IPCA (correção) + 1% a.m. (juros)\nPeríodo 10/2023–atual: IPCA limitado SELIC (correção) + máx(SELIC–IPCA) (juros)"]
[null,"Valor Principal",{"$f":"C10","v":200000}]
[null,"Valor da Atualização Monetária",{"$f":"IFERROR(INDEX(E21:E420,MATCH(2,1/(E21:E420<>\"\"),1))-C10,0)","v":92770.006368750823}]
[null,"Valor dos Juros",{"$f":"IFERROR(LOOKUP(2,1/(F21:F420<>\"\"),F21:F420),0)","v":229297.46898800222}]
[null,"Valor Final a Pagar",{"$f":"C10+C15+C16","v":522067.47535675304}]
[]
[null,"MEMÓRIA DE CÁLCULO DETALHADA"]
[null,"Mês","Atualiz. %","Juros %","Crédito Corrigido (R$)","Juros Acumulados (R$)"]
[null,{"$f":"IFERROR(IF(EDATE($C$8,0)>$C$9,\"\",IF(EDATE($C$8,0)>DATE(2099,12,1),\"\",EDATE($C$8,0))),\"\")","v":"2018-11-01"},{"$f":"IFERROR(IF(B21=\"\",\"\",VLOOKUP(B21,Índices!$A:$H,5,0)),\"\")","v":4.7999999999999996E-3},{"$f":"IFERROR(IF(B21=\"\",\"\",VLOOKUP(B21,Índices!$A:$H,6,0)),\"\")","v":0.01},{"$f":"IFERROR(IF(B21=\"\",\"\",$C$10*VLOOKUP(B21,Índices!$A:$H,7,0)/VLOOKUP(EDATE($C$8,-1),Índices!$A:$H,7,0)),\"\")","v":200959.99999999997},{"$f":"IFERROR(IF(B21=\"\",\"\",E21*(VLOOKUP(B21,Índices!$A:$H,8,0)-VLOOKUP(EDATE($C$8,-1),Índices!$A:$H,8,0))),\"\")","v":2009.5999999999569},null,{"$f":"IF(B21=\"\",\"vazia\",\"1\")","v":"1"}]
[null,{"$f":"IFERROR(IF(EDATE($C$8,1)>$C$9,\"\",IF(EDATE($C$8,1)>DATE(2099,12,1),\"\",EDATE($C$8,1))),\"\")","v":"2018-12-01"},{"$f":"IFERROR(IF(B22=\"\",\"\",VLOOKUP(B22,Índices!$A:$H,5,0)),\"\")","v":4.4999999999999997E-3},{"$f":"IFERROR(IF(B22=\"\",\"\",VLOOKUP(B22,Índices!$A:$H,6,0)),\"\")","v":0.01},{"$f":"IFERROR(IF(B22=\"\",\"\",$C$10*VLOOKUP(B22,Índices!$A:$H,7,0)/VLOOKUP(EDATE($C$8,-1),Índices!$A:$H,7,0)),\"\")","v":201864.31999999998},{"$f":"IFERROR(IF(B22=\"\",\"\",E22*(VLOOKUP(B22,Índices!$A:$H,8,0)-VLOOKUP(EDATE($C$8,-1),Índices!$A:$H,8,0))),\"\")","v":4037.2863999999136},null,{"$f":"IF(B22=\"\",\"vazia\",\"1\")","v":"1"}]
[null,{"$f":"IFERROR(IF(EDATE($C$8,2)>$C$9,\"\",IF(EDATE($C$8,2)>DATE(2099,12,1),\"\",EDATE($C$8,2))),\"\")","v":"2019-01-01"},{"$f":"IFERROR(IF(B23=\"\",\"\",VLOOKUP(B23,Índices!$A:$H,5,0)),\"\")","v":-2.0999999999999999E-3},{"$f":"IFERROR(IF(B23=\"\",\"\",VLOOKUP(B23,Índices!$A:$H,6,0)),\"\")","v":0.01},{"$f":"IFERROR(IF(B23=\"\",\"\",$C$10*VLOOKUP(B23,Índices!$A:$H,7,0)/VLOOKUP(EDATE($C$8,-1),Índices!$A:$H,7,0)),\"\")","v":201440.40492799997},{"$f":"IFERROR(IF(B23=\"\",\"\",E23*(VLOOKUP(B23,Índices!$A:$H,8,0)-VLOOKUP(EDATE($C$8,-1),Índices!$A:$H,8,0))),\"\")","v":6043.2121478398703},null,"1"]
[null,{"$f":"IFERROR(IF(EDATE($C$8,3)>$C$9,\"\",IF(EDATE($C$8,3)>DATE(2099,12,1),\"\",EDATE($C$8,3))),\"\")","v":"2019-02-01"},{"$f":"IFERROR(IF(B24=\"\",\"\",VLOOKUP(B24,Índices!$A:$H,5,0)),\"\")","v":1.5E-3},{"$f":"IFERROR(IF(B24=\"\",\"\",VLOOKUP(B24,Índices!$A:$H,6,0)),\"\")","v":0.01},{"$f":"IFERROR(IF(B24=\"\",\"\",$C$10*VLOOKUP(B24,Índices!$A:$H,7,0)/VLOOKUP(EDATE($C$8,-1),Índices!$A:$H,7,0)),\"\")","v":201742.56553539197},{"$f":"IFERROR(IF(B24=\"\",\"\",E24*(VLOOKUP(B24,Índices!$A:$H,8,0)-VLOOKUP(EDATE($C$8,-1),Índices!$A:$H,8,0))),\"\")","v":8069.7026214155067},null,"1"]
[null,{"$f":"IFERROR(IF(EDATE($C$8,4)>$C$9,\"\",IF(EDATE($C$8,4)>DATE(2099,12,1),\"\",EDATE($C$8,4))),\"\")","v":"2019-03-01"},{"$f":"IFERROR(IF(B25=\"\",\"\",VLOOKUP(B25,Índices!$A:$H,5,0)),\"\")","v":3.2000000000000002E-3},{"$f":"IFERROR(IF(B25=\"\",\"\",VLOOKUP(B25,Índices!$A:$H,6,0)),\"\")","v":0.01},{"$f":"IFERROR(IF(B25=\"\",\"\",$C$10*VLOOKUP(B25,Índices!$A:$H,7,0)/VLOOKUP(EDATE($C$8,-1),Índices!$A:$H,7,0)),\"\")","v":202388.14174510521},{"$f":"IFERROR(IF(B25=\"\",\"\",E25*(VLOOKUP(B25,Índices!$A:$H,8,0)-VLOOKUP(EDATE($C$8,-1),Índices!$A:$H,8,0))),\"\")","v":10119.407087255046},null,"1"]
[null,{"$f":"IFERROR(IF(EDATE($C$8,5)>$C$9,\"\",IF(EDATE($C$8,5)>DATE(2099,12,1),\"\",EDATE($C$8,5))),\"\")","v":"2019-04-01"},{"$f":"IFERROR(IF(B26=\"\",\"\",VLOOKUP(B26,Índices!$A:$H,5,0)),\"\")","v":4.3E-3},{"$f":"IFERROR(IF(B26=\"\",\"\",VLOOKUP(B26,Índices!$A:$H,6,0)),\"\")","v":0.01},{"$f":"IFERROR(IF(B26=\"\",\"\",$C$10*VLOOKUP(B26,Índices!$A:$H,7,0)/VLOOKUP(EDATE($C$8,-1),Índices!$A:$H,7,0)),\"\")","v":203258.41075460915},{"$f":"IFERROR(IF(B26=\"\",\"\",E26*(VLOOKUP(B26,Índices!$A:$H,8,0)-VLOOKUP(EDATE($C$8,-1),Índices!$A:$H,8,0))),\"\")","v":12195.504645276289},null,"1"]
[null,{"$f":"IFERROR(IF(EDATE($C$8,6)>$C$9,\"\",IF(EDATE($C$8,6)>DATE(2099,12,1),\"\",EDATE($C$8,6))),\"\")","v":"2019-05-01"},{"$f":"IFERROR(IF(B27=\"\",\"\",VLOOKUP(B27,Índices!$A:$H,5,0)),\"\")","v":7.4999999999999997E-3},{"$f":"IFERROR(IF(B27=\"\",\"\",VLOOKUP(B27,Índices!$A:$H,6,0)),\"\")","v":0.01},{"$f":"IFERROR(IF(B27=\"\",\"\",$C$10*VLOOKUP(B27,Índices!$A:$H,7,0)/VLOOKUP(EDATE($C$8,-1),Índices!$A:$H,7,0)),\"\")","v":204782.84883526876},{"$f":"IFERROR(IF(B27=\"\",\"\",E27*(VLOOKUP(B27,Índices!$A:$H,8,0)-VLOOKUP(EDATE($C$8,-1),Índices!$A:$H,8,0))),\"\")","v":14334.799418468507},null,"1"]
[null,{"$f":"IFERROR(IF(EDATE($C$8,7)>$C$9,\"\",IF(EDATE($C$8,7)>DATE(2099,12,1),\"\",EDATE($C$8,7))),\"\")","v":"2019-06-01"},{"$f":"IFERROR(IF(B28=\"\",\"\",VLOOKUP(B28,Índices!$A:$H,5,0)),\"\")","v":5.7000000000000002E-3},{"$f":"IFERROR(IF(B28=\"\",\"\",VLOOKUP(B28,Índices!$A:$H,6,0)),\"\")","v":0.01},{"$f":"IFERROR(IF(B28=\"\",\"\",$C$10*VLOOKUP(B28,Índices!$A:$H,7,0)/VLOOKUP(EDATE($C$8,-1),Índices!$A:$H,7,0)),\"\")","v":205950.11107362976},{"$f":"IFERROR(IF(B28=\"\",\"\",E28*(VLOOKUP(B28,Índices!$A:$H,8,0)-VLOOKUP(EDATE($C$8,-1),Índices!$A:$H,8,0))),\"\")","v":16476.008885890031},null,"1"]
[null,{"$f":"IFERROR(IF(EDATE($C$8,8)>$C$9,\"\",IF(EDATE($C$8,8)>DATE(2099,12,1),\"\",EDATE($C$8,8))),\"\")","v":"2019-07-01"},{"$f":"IFERROR(IF(B29=\"\",\"\",VLOOKUP(B29,Índices!$A:$H,5,0)),\"\")","v":1.2999999999999999E-3},{"$f":"IFERROR(IF(B29=\"\",\"\",VLOOKUP(B29,Índices!$A:$H,6,0)),\"\")","v":0.01},{"$f":"IFERROR(IF(B29=\"\",\"\",$C$10*VLOOKUP(B29,Índices!$A:$H,7,0)/VLOOKUP(EDATE($C$8,-1),Índices!$A:$H,7,0)),\"\")","v":206217.84621802552},{"$f":"IFERROR(IF(B29=\"\",\"\",E29*(VLOOKUP(B29,Índices!$A:$H,8,0)-VLOOKUP(EDATE($C$8,-1),Índices!$A:$H,8,0))),\"\")","v":18559.606159621901},null,"1"]
[null,{"$f":"IFERROR(IF(EDATE($C$8,9)>$C$9,\"\",IF(EDATE($C$8,9)>DATE(2099,12,1),\"\",EDATE($C$8,9))),\"\")","v":"2019-08-01"},{"$f":"IFERROR(IF(B30=\"\",\"\",VLOOKUP(B30,Índices!$A:$H,5,0)),\"\")","v":1E-4},{"$f":"IFERROR(IF(B30=\"\",\"\",VLOOKUP(B30,Índices!$A:$H,6,0)),\"\")","v":0.01},{"$f":"IFERROR(IF(B30=\"\",\"\",$C$10*VLOOKUP(B30,Índices!$A:$H,7,0)/VLOOKUP(EDATE($C$8,-1),Índices!$A:$H,7,0)),\"\")","v":206238.46800264734},{"$f":"IFERROR(IF(B30=\"\",\"\",E30*(VLOOKUP(B30,Índices!$A:$H,8,0)-VLOOKUP(EDATE($C$8,-1),Índices!$A:$H,8,0))),\"\")","v":20623.846800264295},null,"1"]
[null,{"$f":"IFERROR(IF(EDATE($C$8,10)>$C$9,\"\",IF(EDATE($C$8,10)>DATE(2099,12,1),\"\",EDATE($C$8,10))),\"\")","v":"2019-09-01"},{"$f":"IFERROR(IF(B31=\"\",\"\",VLOOKUP(B31,Índices!$A:$H,5,0)),\"\")","v":1.9E-3},{"$f":"IFERROR(IF(B31=\"\",\"\",VLOOKUP(B31,Índices!$A:$H,6,0)),\"\")","v":0.01},{"$f":"IFERROR(IF(B31=\"\",\"\",$C$10*VLOOKUP(B31,Índices!$A:$H,7,0)/VLOOKUP(EDATE($C$8,-1),Índices!$A:$H,7,0)),\"\")","v":206630.32109185238},{"$f":"IFERROR(IF(B31=\"\",\"\",E31*(VLOOKUP(B31,Índices!$A:$H,8,0)-VLOOKUP(EDATE($C$8,-1),Índices!$A:$H,8,0))),\"\")","v":22729.335320103277},null,"1"]
[null,{"$f":"IFERROR(IF(EDATE($C$8,11)>$C$9,\"\",IF(EDATE($C$8,11)>DATE(2099,12,1),\"\",EDATE($C$8,11))),\"\")","v":"2019-10-01"},{"$f":"IFERROR(IF(B32=\"\",\"\",VLOOKUP(B32,Índices!$A:$H,5,0)),\"\")","v":1.1000000000000001E-3},{"$f":"IFERROR(IF(B32=\"\",\"\",VLOOKUP(B32,Índices!$A:$H,6,0)),\"\")","v":0.01},{"$f":"IFERROR(IF(B32=\"\",\"\",$C$10*VLOOKUP(B32,Índices!$A:$H,7,0)/VLOOKUP(EDATE($C$8,-1),Índices!$A:$H,7,0)),\"\")","v":206857.61444505345},{"$f":"IFERROR(IF(B32=\"\",\"\",E32*(VLOOKUP(B32,Índices!$A:$H,8,0)-VLOOKUP(EDATE($C$8,-1),Índices!$A:$H,8,0))),\"\")","v":24822.913733405883},null,"1"]
[null,{"$f":"IFERROR(IF(EDATE($C$8,12)>$C$9,\"\",IF(EDATE($C$8,12)>DATE(2099,12,1),\"\",EDATE($C$8,12))),\"\")","v":"2019-11-01"},{"$f":"IFERROR(IF(B33=\"\",\"\",VLOOKUP(B33,Índices!$A:$H,5,0)),\"\")","v":-4.0000000000000002E-4},{"$f":"IFERROR(IF(B33=\"\",\"\",VLOOKUP(B33,Índices!$A:$H,6,0)),\"\")","v":0.01},{"$f":"IFERROR(IF(B33=\"\",\"\",$C$10*VLOOKUP(B33,Índices!$A:$H,7,0)/VLOOKUP(EDATE($C$8,-1),Índices!$A:$H,7,0)),\"\")","v":206774.87139927543},{"$f":"IFERROR(IF(B33=\"\",\"\",E33*(VLOOKUP(B33,Índices!$A:$H,8,0)-VLOOKUP(EDATE($C$8,-1),Índices!$A:$H,8,0))),\"\")","v":26880.733281905232},null,"1"]
[null,{"$f":"IFERROR(IF(EDATE($C$8,13)>$C$9,\"\",IF(EDATE($C$8,13)>DATE(2099,12,1),\"\",EDATE($C$8,13))),\"\")","v":"2019-12-01"},{"$f":"IFERROR(IF(B34=\"\",\"\",VLOOKUP(B34,Índices!$A:$H,5,0)),\"\")","v":1E-3},{"$f":"IFERROR(IF(B34=\"\",\"\",VLOOKUP(B34,Índices!$A:$H,6,0)),\"\")","v":0.01},{"$f":"IFERROR(IF(B34=\"\",\"\",$C$10*VLOOKUP(B34,Índices!$A:$H,7,0)/VLOOKUP(EDATE($C$8,-1),Índices!$A:$H,7,0)),\"\")","v":206981.64627067468},{"$f":"IFERROR(IF(B34=\"\",\"\",E34*(VLOOKUP(B34,Índices!$A:$H,8,0)-VLOOKUP(EDATE($C$8,-1),Índices!$A:$H,8,0))),\"\")","v":28977.430477893839},null,"1"]
[null,{"$f":"IFERROR(IF(EDATE($C$8,14)>$C$9,\"\",IF(EDATE($C$8,14)>DATE(2099,12,1),\"\",EDATE($C$8,14))),\"\")","v":"2020-01-01"},{"$f":"IFERROR(IF(B35=\"\",\"\",VLOOKUP(B35,Índices!$A:$H,5,0)),\"\")","v":5.1000000000000004E-3},{"$f":"IFERROR(IF(B35=\"\",\"\",VLOOKUP(B35,Índices!$A:$H,6,0)),\"\")","v":0.01},{"$f":"IFERROR(IF(B35=\"\",\"\",$C$10*VLOOKUP(B35,Índices!$A:$H,7,0)/VLOOKUP(EDATE($C$8,-1),Índices!$A:$H,7,0)),\"\")","v":208037.25266665517},{"$f":"IFERROR(IF(B35=\"\",\"\",E35*(VLOOKUP(B35,Índices!$A:$H,8,0)-VLOOKUP(EDATE($C$8,-1),Índices!$A:$H,8,0))),\"\")","v":31205.587899997612},null,"1"]
[null,{"$f":"IFERROR(IF(EDATE($C$8,15)>$C$9,\"\",IF(EDATE($C$8,15)>DATE(2099,12,1),\"\",EDATE($C$8,15))),\"\")","v":"2020-02-01"},{"$f":"IFERROR(IF(B36=\"\",\"\",VLOOKUP(B36,Índices!$A:$H,5,0)),\"\")","v":1.15E-2},{"$f":"IFERROR(IF(B36=\"\",\"\",VLOOKUP(B36,Índices!$A:$H,6,0)),\"\")","v":0.01},{"$f":"IFERROR(IF(B36=\"\",\"\",$C$10*VLOOKUP(B36,Índices!$A:$H,7,0)/VLOOKUP(EDATE($C$8,-1),Índices!$A:$H,7,0)),\"\")","v":210429.68107232169},{"$f":"IFERROR(IF(B36=\"\",\"\",E36*(VLOOKUP(B36,Índices!$A:$H,8,0)-VLOOKUP(EDATE($C$8,-1),Índices!$A:$H,8,0))),\"\")","v":33668.748971570756},null,"1"]
[null,{"$f":"IFERROR(IF(EDATE($C$8,16)>$C$9,\"\",IF(EDATE($C$8,16)>DATE(2099,12,1),\"\",EDATE($C$8,16))),\"\")","v":"2020-03-01"},{"$f":"IFERROR(IF(B37=\"\",\"\",VLOOKUP(B37,Índices!$A:$H,5,0)),\"\")","v":2.0999999999999999E-3},{"$f":"IFERROR(IF(B37=\"\",\"\",VLOOKUP(B37,Índices!$A:$H,6,0)),\"\")","v":0.01},{"$f":"IFERROR(IF(B37=\"\",\"\",$C$10*VLOOKUP(B37,Índices!$A:$H,7,0)/VLOOKUP(EDATE($C$8,-1),Índices!$A:$H,7,0)),\"\")","v":210871.58340257357},{"$f":"IFERROR(IF(B37=\"\",\"\",E37*(VLOOKUP(B37,Índices!$A:$H,8,0)-VLOOKUP(EDATE($C$8,-1),Índices!$A:$H,8,0))),\"\")","v":35848.169178436743},null,"1"]
[null,{"$f":"IFERROR(IF(EDATE($C$8,17)>$C$9,\"\",IF(EDATE($C$8,17)>DATE(2099,12,1),\"\",EDATE($C$8,17))),\"\")","v":"2020-04-01"},{"$f":"IFERROR(IF(B38=\"\",\"\",VLOOKUP(B38,Índices!$A:$H,5,0)),\"\")","v":2.5000000000000001E-3},{"$f":"IFERROR(IF(B38=\"\",\"\",VLOOKUP(B38,Índices!$A:$H,6,0)),\"\")","v":0.01},{"$f":"IFERROR(IF(B38=\"\",\"\",$C$10*VLOOKUP(B38,Índices!$A:$H,7,0)/VLOOKUP(EDATE($C$8,-1),Índices!$A:$H,7,0)),\"\")","v":211398.76236108001},{"$f":"IFERROR(IF(B38=\"\",\"\",E38*(VLOOKUP(B38,Índices!$A:$H,8,0)-VLOOKUP(EDATE($C$8,-1),Índices!$A:$H,8,0))),\"\")","v":38051.777224993588},null,"1"]
[null,{"$f":"IFERROR(IF(EDATE($C$8,18)>$C$9,\"\",IF(EDATE($C$8,18)>DATE(2099,12,1),\"\",EDATE($C$8,18))),\"\")","v":"2020-05-01"},{"$f":"IFERROR(IF(B39=\"\",\"\",VLOOKUP(B39,Índices!$A:$H,5,0)),\"\")","v":6.9999999999999999E-4},{"$f":"IFERROR(IF(B39=\"\",\"\",VLOOKUP(B39,Índices!$A:$H,6,0)),\"\")","v":0.01},{"$f":"IFERROR(IF(B39=\"\",\"\",$C$10*VLOOKUP(B39,Índices!$A:$H,7,0)/VLOOKUP(EDATE($C$8,-1),Índices!$A:$H,7,0)),\"\")","v":211546.74149473276},{"$f":"IFERROR(IF(B39=\"\",\"\",E39*(VLOOKUP(B39,Índices!$A:$H,8,0)-VLOOKUP(EDATE($C$8,-1),Índices!$A:$H,8,0))),\"\")","v":40193.880883998369},null,"1"]
[null,{"$f":"IFERROR(IF(EDATE($C$8,19)>$C$9,\"\",IF(EDATE($C$8,19)>DATE(2099,12,1),\"\",EDATE($C$8,19))),\"\")","v":"2020-06-01"},{"$f":"IFERROR(IF(B40=\"\",\"\",VLOOKUP(B40,Índices!$A:$H,5,0)),\"\")","v":-3.0999999999999999E-3},{"$f":"IFERROR(IF(B40=\"\",\"\",VLOOKUP(B40,Índices!$A:$H,6,0)),\"\")","v":0.01},{"$f":"IFERROR(IF(B40=\"\",\"\",$C$10*VLOOKUP(B40,Índices!$A:$H,7,0)/VLOOKUP(EDATE($C$8,-1),Índices!$A:$H,7,0)),\"\")","v":210890.94659609909},{"$f":"IFERROR(IF(B40=\"\",\"\",E40*(VLOOKUP(B40,Índices!$A:$H,8,0)-VLOOKUP(EDATE($C$8,-1),Índices!$A:$H,8,0))),\"\")","v":42178.189319218916},null,"1"]
{"$rows_left_out":462}
{"sheet":"atualização","index":2,"n_rows":124,"n_cols":5,"rows_kept":124,"cut":false,"hidden":true,"merged":[[123,0,123,4],[0,0,0,4],[116,0,116,4],[122,0,122,4],[118,0,118,4],[119,0,119,4],[121,0,121,4],[3,0,3,4],[1,0,1,4],[120,0,120,4],[115,0,115,4],[117,0,117,4]]}
["ÍNDICES SELIC E IPCA – ATUALIZAÇÃO MONETÁRIA"]
["Período: 01/01/2026 a 31/12/2034  |  Fonte: BCB (SELIC – Série 4390) e IBGE (IPCA)  |  Atualização automática via macro ao abrir"]
[]
["⚠  INSTRUÇÕES: Esta aba é alimentada automaticamente pela macro ao abrir a planilha. Os valores já preenchidos são os dados oficiais publicados. Para meses futuros ainda não divulgados, insira manualmente a SELIC (% a.m.) e o IPCA (% a.m.) nas colunas B e C."]
[]
["Mês/Ano","SELIC (% a.m.)","IPCA (% a.m.)","Fonte SELIC","Fonte IPCA"]
["2026-01-01",1.1599999999999999E-2,3.3E-3,"BCB Oficial","IBGE/IPCA Mensal"]
["2026-02-01",0.01,6.9999999999999993E-3,"BCB Oficial","IBGE/IPCA Mensal"]
["2026-03-01",1.21E-2,8.8000000000000005E-3,"BCB Oficial","IBGE/IPCA Mensal"]
["2026-04-01",1.09E-2,6.7000000000000002E-3,"BCB Oficial","IBGE/IPCA Mensal"]
["2026-05-01",1.0700000000000001E-2,5.7999999999999996E-3,"BCB Oficial","IBGE/IPCA Mensal"]
["2026-06-01",1.1200000000000002E-2,null,"BCB Oficial","Não divulgado"]
["2026-07-01",5.0000000000000001E-4,null,"BCB Oficial","Não divulgado"]
["2026-08-01",null,null,"Não divulgado","Não divulgado"]
["2026-09-01",null,null,"Não divulgado","Não divulgado"]
["2026-10-01",null,null,"Não divulgado","Não divulgado"]
["2026-11-01",null,null,"Não divulgado","Não divulgado"]
["2026-12-01",null,null,"Não divulgado","Não divulgado"]
["2027-01-01",null,null,"Não divulgado","Não divulgado"]
["2027-02-01",null,null,"Não divulgado","Não divulgado"]
["2027-03-01",null,null,"Não divulgado","Não divulgado"]
["2027-04-01",null,null,"Não divulgado","Não divulgado"]
["2027-05-01",null,null,"Não divulgado","Não divulgado"]
["2027-06-01",null,null,"Não divulgado","Não divulgado"]
["2027-07-01",null,null,"Não divulgado","Não divulgado"]
["2027-08-01",null,null,"Não divulgado","Não divulgado"]
["2027-09-01",null,null,"Não divulgado","Não divulgado"]
["2027-10-01",null,null,"Não divulgado","Não divulgado"]
["2027-11-01",null,null,"Não divulgado","Não divulgado"]
["2027-12-01",null,null,"Não divulgado","Não divulgado"]
["2028-01-01",null,null,"Não divulgado","Não divulgado"]
["2028-02-01",null,null,"Não divulgado","Não divulgado"]
["2028-03-01",null,null,"Não divulgado","Não divulgado"]
["2028-04-01",null,null,"Não divulgado","Não divulgado"]
["2028-05-01",null,null,"Não divulgado","Não divulgado"]
["2028-06-01",null,null,"Não divulgado","Não divulgado"]
["2028-07-01",null,null,"Não divulgado","Não divulgado"]
["2028-08-01",null,null,"Não divulgado","Não divulgado"]
["2028-09-01",null,null,"Não divulgado","Não divulgado"]
["2028-10-01",null,null,"Não divulgado","Não divulgado"]
{"$rows_left_out":85}
{"sheet":"Índices","index":3,"n_rows":428,"n_cols":9,"rows_kept":428,"cut":false,"hidden":true,"merged":[[427,0,427,7],[2,0,2,7],[1,0,1,7]]}
[]
["TABELA DE ÍNDICES – SELIC, IPCA, ATUALIZAÇÃO E JUROS (02/2000 em diante)"]
["Fonte: Planilha de Apoio DSC/SEFAZ-PE (Nota Técnica nº 2/2026). Para atualizar: insira novos meses nas linhas seguintes com os índices SELIC e IPCA; as colunas Atualização e Juros são calculadas automaticamente."]
["Mês/Ano","SELIC (%)","IPCA (%)","Regime","Índice Acum. Correção","Índice Acum. Juros","Fator Corr. Acumulado","Fator Juros Acumulado"]
["2000-02-01",1.4500000000000001E-2,null,"SELIC",0,1.46E-2,{"$f":"1+E5","v":1},{"$f":"F5","v":1.46E-2}]
["2000-03-01",1.4500000000000001E-2,null,"SELIC",0,1.4500000000000001E-2,{"$f":"G5*(1+E6)","v":1},{"$f":"H5+F6","v":2.9100000000000001E-2}]
["2000-04-01",1.2999999999999999E-2,null,"SELIC",0,1.4500000000000001E-2,1,4.36E-2]
["2000-05-01",1.49E-2,null,"SELIC",0,1.2999999999999999E-2,1,5.6599999999999998E-2]
["2000-06-01",1.3899999999999999E-2,null,"SELIC",0,1.49E-2,1,7.1499999999999994E-2]
["2000-07-01",1.3100000000000001E-2,null,"SELIC",0,1.3899999999999999E-2,1,8.539999999999999E-2]
["2000-08-01",1.41E-2,null,"SELIC",0,1.3100000000000001E-2,1,9.849999999999999E-2]
["2000-09-01",1.2200000000000001E-2,null,"SELIC",0,1.41E-2,1,0.11259999999999999]
["2000-10-01",1.29E-2,null,"SELIC",0,1.2200000000000001E-2,1,0.12479999999999999]
["2000-11-01",1.2200000000000001E-2,null,"SELIC",0,1.29E-2,1,0.13769999999999999]
["2000-12-01",1.2E-2,null,"SELIC",0,1.2200000000000001E-2,1,0.14989999999999998]
["2001-01-01",1.2699999999999999E-2,null,"SELIC",0,1.2E-2,1,0.16189999999999999]
["2001-02-01",1.0200000000000001E-2,null,"SELIC",0,1.2699999999999999E-2,1,0.17459999999999998]
["2001-03-01",1.26E-2,null,"SELIC",0,1.0200000000000001E-2,1,0.18479999999999996]
["2001-04-01",1.1900000000000001E-2,null,"SELIC",0,1.26E-2,1,0.19739999999999996]
["2001-05-01",1.34E-2,null,"SELIC",0,1.1900000000000001E-2,1,0.20929999999999996]
["2001-06-01",1.2699999999999999E-2,null,"SELIC",0,1.34E-2,1,0.22269999999999995]
["2001-07-01",1.4999999999999999E-2,null,"SELIC",0,1.2699999999999999E-2,1,0.23539999999999994]
["2001-08-01",1.6E-2,null,"SELIC",0,1.4999999999999999E-2,1,0.25039999999999996]
["2001-09-01",1.32E-2,null,"SELIC",0,1.6E-2,1,0.26639999999999997]
["2001-10-01",1.5299999999999999E-2,null,"SELIC",0,1.32E-2,1,0.27959999999999996]
["2001-11-01",1.3899999999999999E-2,null,"SELIC",0,1.5299999999999999E-2,1,0.29489999999999994]
["2001-12-01",1.3899999999999999E-2,null,"SELIC",0,1.3899999999999999E-2,1,0.30879999999999996]
["2002-01-01",1.5299999999999999E-2,null,"SELIC",0,1.3899999999999999E-2,1,0.32269999999999999]
["2002-02-01",1.2500000000000001E-2,null,"SELIC",0,1.5299999999999999E-2,1,0.33799999999999997]
["2002-03-01",1.37E-2,null,"SELIC",0,1.2500000000000001E-2,1,0.35049999999999998]
["2002-04-01",1.4800000000000001E-2,null,"SELIC",0,1.37E-2,1,0.36419999999999997]
["2002-05-01",1.41E-2,null,"SELIC",0,1.4800000000000001E-2,1,0.37899999999999995]
["2002-06-01",1.3299999999999999E-2,null,"SELIC",0,1.41E-2,1,0.39309999999999995]
["2002-07-01",1.54E-2,null,"SELIC",0,1.3299999999999999E-2,1,0.40639999999999993]
["2002-08-01",1.44E-2,null,"SELIC",0,1.54E-2,1,0.42179999999999995]
["2002-09-01",1.38E-2,null,"SELIC",0,1.44E-2,1,0.43619999999999998]
["2002-10-01",1.6500000000000001E-2,null,"SELIC",0,1.38E-2,1,0.44999999999999996]
["2002-11-01",1.54E-2,null,"SELIC",0,1.6500000000000001E-2,1,0.46649999999999997]
["2002-12-01",1.7399999999999999E-2,null,"SELIC",0,1.54E-2,1,0.4819]
["2003-01-01",1.9699999999999999E-2,null,"SELIC",0,1.7399999999999999E-2,1,0.49929999999999997]
{"$rows_left_out":388}